program: Gaussian 09
title: 000220590
version: EM64L-G09RevD.01
frameworkgroup: C1[X(C17H22N2)]
method: RPBEPBE
basis: SDD
operation: Freq
keyword: #pfreq=noraman
keyword: PBEPBE/SDD
title: #p freq=noraman PBEPBE/SDD
converged: YES YES NO NO
title: Mulliken charges:
elementType: N N C C C C C C C C C C C C C C C C C H H H H H H H H H H H H H H H H H H H H H H
charge: -0.705292 -0.705294 -0.711788 0.383840 0.383835 0.294769 0.294770 -0.585951 -0.585988 0.327524 0.327541 -0.646567 -0.646586 0.330944 0.330956 -0.859629 -0.859608 -0.856044 -0.856045 0.230290 0.230335 0.245502 0.245518 0.212788 0.212789 0.227292 0.227867 0.231932 0.227857 0.231930 0.227294 0.219766 0.219758 0.241146 0.219757 0.241148 0.219763 0.298895 0.317049 0.298894 0.317047
chargesum: 0.00000
title: Mulliken charges with hydrogens summed into heavy atoms:
elementType: N N C C C C C C C C C C C C C C C C C
charge: -0.089348 -0.089353 -0.251163 0.383840 0.383835 0.294769 0.294770 -0.340449 -0.340470 0.327524 0.327541 -0.433778 -0.433797 0.330944 0.330956 -0.172538 -0.172528 -0.175374 -0.175377
polarizability: 2.59644676e+02 -1.35533233e-02 1.92449945e+02 -1.79667163e+01 1.48997884e-03 1.62500638e+02
1716.lowfreq: -20.7963 -5.2409 -3.7713 -0.0004 0.0000 0.0008 8.7980 18.1275 42.0456
frequency: -20.5898 18.0649 42.0453 97.3400 101.9024 148.2612 160.5174 172.6981 175.2065 182.2706 186.2923 201.9404 241.1257 244.2161 260.0017 276.0966 279.5624 294.5744 301.8838 309.4112 309.6586 341.3869 344.9672 388.0996 389.8046 431.4233 445.8585 446.6439 462.4636 502.0132 503.7788 535.6711 563.0080 615.8096 626.5467 673.3720 684.7335 726.2826 727.9858 741.3285 749.8403 824.7948 837.6399 852.5203 852.6687 885.1000 909.2058 946.4064 983.3382 985.2606 1006.2657 1006.6577 1038.0340 1039.0154 1042.1229 1042.1356 1047.8605 1049.8013 1073.3818 1098.7396 1181.1148 1196.1183 1207.1735 1220.8480 1226.6660 1270.7616 1285.1067 1310.0374 1326.5767 1333.0493 1379.6248 1381.0676 1391.4761 1392.6610 1395.9346 1397.1923 1417.0557 1421.1795 1457.8447 1471.9683 1472.4056 1472.5276 1474.5189 1475.3716 1485.6682 1488.0524 1490.5916 1516.5174 1518.1441 1579.1600 1584.9144 1628.3216 1628.6576 1641.5387 1641.6612 2944.7253 2944.9506 2968.7186 2968.7755 2977.6286 3009.3968 3009.5755 3015.3615 3043.6134 3043.6763 3075.2690 3075.3324 3080.8516 3080.8679 3100.3978 3100.6301 3111.9712 3112.4367 3574.5411 3574.7367 3715.2873 3715.3006
redmass: 3.5354 3.4832 4.6138 3.1413 3.0977 2.1922 1.9316 1.1926 1.0651 1.1583 1.3864 3.9675 2.1257 1.9772 1.8563 1.5975 1.6212 2.6494 2.7765 2.6081 2.5114 1.7836 2.1958 1.4508 1.4595 4.2712 3.0521 2.6942 4.1100 2.9802 3.7156 3.3862 4.4928 4.1124 4.7698 3.8282 3.8141 3.7811 2.7215 5.7415 3.8972 2.8752 2.8620 1.5356 1.5296 1.3854 1.4166 1.8464 1.5852 1.5720 1.4210 1.4327 1.5407 1.5607 1.5125 1.5065 1.4534 1.5260 4.6916 3.5770 1.6812 2.3821 1.6020 1.7162 1.9591 1.5608 1.2830 1.6755 4.9491 3.7839 2.5059 2.4783 1.5845 1.6603 1.3030 1.3025 3.2346 3.2844 1.0669 1.0503 1.0469 1.0481 1.0815 1.0783 1.0832 1.2116 1.2198 3.4996 3.3623 6.9075 6.7445 1.6711 1.7523 2.3965 2.2954 1.0394 1.0393 1.0375 1.0373 1.0588 1.0974 1.0973 1.0985 1.0973 1.0974 1.0982 1.0981 1.0950 1.0950 1.0903 1.0902 1.0910 1.0906 1.0446 1.0447 1.1036 1.1036
irintensity: 0.3659 0.0244 0.8626 1.2468 0.0812 5.9673 2.9201 0.3637 0.3114 0.7627 0.1236 0.7027 38.4593 28.5440 44.1812 136.6191 223.2233 1.3282 2.3236 21.0634 2.7825 23.6455 13.1670 13.7785 25.0625 1.5518 2.6015 13.1434 1.7088 2.8138 0.4906 5.7540 0.6530 0.0555 0.2569 0.5832 2.3257 0.1437 0.3073 1.2718 0.0155 6.3717 0.4429 30.9888 18.0016 12.6373 4.4893 7.0435 12.6627 13.7978 4.0732 6.8618 0.7358 0.4726 12.2455 8.5716 10.8339 11.2672 6.1293 4.6869 0.0018 20.5338 2.3877 33.7149 0.2550 25.8493 3.4863 2.8536 19.3108 53.5073 4.7132 0.0038 11.3226 15.8850 23.7126 15.5737 25.5140 3.3527 13.2569 1.3393 28.8780 6.9899 4.3213 0.0708 1.8523 55.9031 2.3818 203.3562 60.0604 46.1341 0.1535 47.5109 2.6911 308.5627 109.8593 51.5533 67.8790 37.0426 29.1663 40.0871 37.1799 22.9762 18.8973 19.7767 23.4693 57.7423 0.0677 26.5606 1.1794 95.6859 2.0377 15.3122 1.6053 88.7125 24.8546 19.5841 18.1044
temp: 298.150 k
press: 1.00000 atm
elementType: 7 7 6 6 6 6 6 6 6 6 6 6 6 6 6 6 6 6 6 1 1 1 1 1 1 1 1 1 1 1 1 1 1 1 1 1 1 1 1 1 1
symmnumber: 1
zpe: 911737.4 jmol-1
zpe.correction: 0.347262 hartree
zpe.thermalcorrener: 0.366845 hartree
zpe.thermalcorrenthalpy: 0.367789 hartree
zpe.thermalcorrgfe: 0.300625 hartree
zpe.sumelectzpe: -769.143342 hartree
zpe.sumelectthermal: -769.123760 hartree
zpe.sumelectthermalent: -769.122816 hartree
zpe.sumelectthermalfe: -769.189980 hartree
dipole: 0.0004 -1.8351 -0.0001
dipole: 1.8351
quadrupole: -83.8455 -106.8463 -112.3924
quadrupole: -0.0023 -3.9519 0.0003
quadrupole: 17.1826 -5.8182 -11.3644 -0.0023 -3.9519 0.0003
hfenergy: -769.4906049 hartree
pointgroup: C01 [X(C17H22N2)]
dipole: -0.000016 0.0004584 0.7219651 debye
polarizability: 257.3963728|-23.1550675|164.7489506|-0.0112252|0.0216514|192.4499358 unknown
InChI: InChI=1S/C17H22N2/c1-10-7-16(18)12(3)5-14(10)9-15-6-13(4)17(19)8-11(15)2/h5-8H,9,18-19H2,1-4H3
charge 0 multiplicity 1
41 atoms
N  -4.916511 0.175048 1.416429
N  4.916172 -0.173201 1.415489
C  -0.000546 -0.001194 -1.650841
C  -1.292309 0.103561 -0.835042
C  1.291419 -0.104796 -0.835199
C  -2.33011 1.022101 -1.171137
C  2.329579 -1.023051 -1.17096
C  -1.504417 -0.773092 0.25916
C  1.503374 0.772654 0.258391
C  -2.686025 -0.784328 1.028248
C  2.68516 0.784921 1.027199
C  -3.520607 1.026856 -0.406907
C  3.520253 -1.026775 -0.407007
C  -3.721187 0.141143 0.685045
C  3.720669 -0.140286 0.684349
C  -2.197634 1.99761 -2.332925
C  2.197277 -1.999317 -2.332129
C  -2.868618 -1.742679 2.19132
C  2.867569 1.744089 2.189628
H  -0.076045 -0.87821 -2.323106
H  0.07481 0.874832 -2.324406
H  -0.699786 -1.469945 0.52718
H  0.69849 1.469308 0.526165
H  -4.317025 1.737335 -0.66726
H  4.316941 -1.737044 -0.667103
H  -3.097356 2.631316 -2.417738
H  -1.326507 2.669451 -2.209693
H  -2.065941 1.473193 -3.298498
H  1.32666 -2.671684 -2.208136
H  2.0648 -1.475542 -3.297942
H  3.097392 -2.63246 -2.416969
H  -3.02842 -1.206544 3.149797
H  -3.737901 -2.416151 2.041768
H  -1.977942 -2.380241 2.319223
H  3.736502 2.417874 2.039454
H  1.976625 2.381317 2.317334
H  3.027839 1.208629 3.148404
H  -5.651611 0.831064 1.171859
H  -5.06886 -0.450527 2.200218
H  5.651497 -0.829064 1.171184
H  5.068424 0.452932 2.198852
