program: Gaussian 09
title: 000220586
version: EM64L-G09RevD.01
frameworkgroup: C1[X(C10H15NO)]
method: RPBEPBE
basis: SDD
operation: Freq
keyword: #p
keyword: freq=noraman
keyword: PBEPBE/SDD
title: #p freq=noraman PBEPBE/SDD
converged: YES YES NO NO
title: Mulliken charges:
elementType: O N C C C C C C C C C C H H H H H H H H H H H H H H H
charge: -0.432957 -0.198116 0.384870 0.223418 -0.600378 -0.380136 -0.330186 -0.327835 -0.261893 -0.253047 -0.653289 -0.655327 0.236946 0.236315 0.230753 0.235509 0.188385 0.227345 0.225592 0.222793 0.246579 0.196284 0.225260 0.211746 0.246848 0.222864 0.331657
chargesum: 0.00000
title: Mulliken charges with hydrogens summed into heavy atoms:
elementType: O N C C C C C C C C C C
charge: -0.101300 -0.198116 0.384870 0.223418 -0.127117 -0.149382 -0.094678 0.087896 -0.036301 -0.030254 0.014834 0.026130
polarizability: 1.37018614e+02 -4.52058403e+00 1.46516122e+02 7.11937441e+00 -1.54385121e+00 7.26160854e+01
1716.lowfreq: -9.8547 -4.5006 -0.0005 0.0003 0.0003 4.6094 67.6651 69.4024 90.7224
frequency: 67.6614 69.4021 90.7130 124.0680 140.8596 169.5949 221.4057 257.5009 268.9213 294.3727 310.5257 333.2791 343.4472 374.2084 454.2235 510.5333 522.8484 557.9492 604.4473 699.6522 745.3085 765.1702 804.9429 825.0491 862.5625 937.8569 944.3294 957.9953 976.2770 1008.5903 1028.6535 1047.5221 1051.5605 1085.5997 1088.1612 1129.6560 1139.0065 1156.0374 1174.8655 1197.7578 1207.9146 1260.9737 1275.9283 1295.5121 1326.5980 1333.9113 1376.0418 1377.7259 1422.6723 1431.8124 1447.4435 1460.3155 1469.0589 1474.7842 1482.9270 1489.3571 1490.9108 1504.7117 1579.8819 1607.4177 2884.3690 2898.1035 2951.6220 2992.2939 3018.1873 3021.0456 3044.5309 3081.6922 3092.3291 3111.8331 3120.7832 3126.3096 3147.3909 3161.9798 3559.2572
redmass: 3.2389 3.8311 3.6482 2.5038 1.6086 1.8150 1.8396 2.7729 1.2513 1.9388 2.8513 1.8723 2.7362 2.6063 2.9875 3.8731 3.9430 3.3524 5.5841 3.9136 2.7715 1.5845 1.1569 3.7589 1.4744 1.5186 3.3807 3.1964 1.3182 1.9411 3.5951 1.5021 2.0350 1.5939 1.3644 1.4138 1.3657 1.6786 1.0769 2.0827 3.2005 1.3270 1.2740 1.4463 2.2987 1.5797 2.2277 1.7707 1.1498 1.7635 1.3844 1.0598 1.0728 1.1222 1.1423 1.4773 1.0824 1.3058 6.7156 6.0768 1.0545 1.0550 1.0699 1.0594 1.0817 1.0775 1.0992 1.0961 1.0991 1.0875 1.0940 1.0874 1.0927 1.1001 1.0661
irintensity: 5.0058 0.3372 0.7167 4.6455 1.2659 1.5462 3.7903 6.3752 1.0156 34.4159 11.7761 103.7487 4.1172 14.3172 6.7251 6.5953 10.7040 2.8132 2.1143 1.4499 17.8952 65.0212 4.5606 1.3093 1.0442 10.6285 36.5427 103.6990 1.0533 8.2067 23.0917 14.3503 21.5274 8.3314 20.5065 40.4509 25.6914 10.9280 0.8181 15.2237 10.9244 22.1603 0.6739 1.0932 27.5571 22.3241 4.8530 24.8654 5.0897 16.1471 1.3045 13.7979 39.8541 20.1613 12.6962 19.5258 4.2441 49.4393 5.5076 31.3121 88.3715 165.6206 61.3065 33.8558 54.6971 37.7679 7.4116 29.0981 25.2285 12.4302 15.6966 8.7452 30.0189 24.3408 7.8505
temp: 298.150 k
press: 1.00000 atm
elementType: 8 7 6 6 6 6 6 6 6 6 6 6 1 1 1 1 1 1 1 1 1 1 1 1 1 1 1
symmnumber: 1
zpe: 603337.4 jmol-1
zpe.correction: 0.229799 hartree
zpe.thermalcorrener: 0.242464 hartree
zpe.thermalcorrenthalpy: 0.243408 hartree
zpe.thermalcorrgfe: 0.191118 hartree
zpe.sumelectzpe: -519.084666 hartree
zpe.sumelectthermal: -519.072001 hartree
zpe.sumelectthermalent: -519.071057 hartree
zpe.sumelectthermalfe: -519.123347 hartree
dipole: 1.9138 2.3273 0.3440
dipole: 3.0328
quadrupole: -79.7751 -63.7332 -76.2418
quadrupole: -3.3589 1.3956 0.0373
quadrupole: -6.5251 9.5168 -2.9918 -3.3589 1.3956 0.0373
hfenergy: -519.3144651 hartree
pointgroup: C01 [X(C10H15N1O1)]
dipole: -0.2120974 1.1731694 0.0485824 debye
polarizability: 143.8214151|5.859273|139.6435638|3.0344422|7.2782489|72.6858423 unknown
InChI: InChI=1S/C10H15NO/c1-11(2)10-6-4-3-5-9(10)7-8-12/h3-6,12H,7-8H2,1-2H3
charge 0 multiplicity 1
27 atoms
O  3.626243 -1.885631 -0.467237
N  0.344491 1.779156 0.44069
C  0.007769 -0.68031 0.194209
C  -0.519472 0.654798 0.215233
C  1.474663 -0.993047 0.464493
C  -0.887096 -1.759302 -0.01286
C  -1.925034 0.840341 0.072585
C  2.240258 -1.504842 -0.780926
C  -2.276418 -1.564868 -0.174313
C  -2.795704 -0.252927 -0.116487
C  -0.246326 2.987256 1.039652
C  1.343637 2.101785 -0.599579
H  1.546163 -1.787912 1.231509
H  1.976662 -0.099098 0.880514
H  -0.484572 -2.780743 -0.00644
H  -2.338631 1.853801 0.09536
H  2.211527 -0.757727 -1.603343
H  1.783741 -2.434789 -1.157796
H  -2.941642 -2.422426 -0.321322
H  -3.872209 -0.077841 -0.225958
H  -0.901059 2.710554 1.882436
H  -0.837548 3.603761 0.320271
H  0.568423 3.624861 1.430005
H  0.901235 2.700346 -1.430894
H  1.758437 1.183444 -1.038908
H  2.17288 2.687699 -0.159984
H  4.098778 -1.09854 -0.094813
