program: Gaussian 09
title: 000220570
version: EM64L-G09RevD.01
frameworkgroup: C1[X(C11H16N2O2)]
method: RPBEPBE
basis: SDD
operation: Freq
keyword: #p
keyword: freq=noraman
keyword: PBEPBE/SDD
title: #p freq=noraman PBEPBE/SDD
converged: YES YES NO NO
title: Mulliken charges:
elementType: O O N N C C C C C C C C C C C H H H H H H H H H H H H H H H H
charge: -0.212090 -0.212559 -0.279629 0.027128 -0.365818 -0.572486 -0.329332 0.510638 -0.376026 -0.381963 -0.378763 -0.677820 -0.356225 -0.356472 0.366036 0.221955 0.199828 0.237466 0.205640 0.175159 0.206634 0.240158 0.220748 0.185734 0.249024 0.244652 0.208554 0.210341 0.220812 0.284490 0.284187
chargesum: 0.00000
title: Mulliken charges with hydrogens summed into heavy atoms:
elementType: O O N N C C C C C C C C C C C
charge: -0.212090 -0.212559 -0.039471 0.027128 0.055965 -0.129379 0.052461 0.510638 0.030456 -0.132939 -0.134111 -0.038114 -0.071735 -0.072285 0.366036
polarizability: 2.24084357e+02 -5.00361188e+00 1.33721245e+02 -2.02977671e+01 -6.80388304e+00 9.44047869e+01
1716.lowfreq: -16.7421 -5.3726 -4.3693 -0.0005 -0.0005 0.0003 9.0135 32.0387 45.5000
frequency: -3.4561 32.0124 45.4605 54.1702 65.4008 92.9569 127.6610 132.9505 155.0797 211.6032 219.4665 231.9274 296.6027 348.4009 369.0785 399.4225 408.3744 459.7355 507.1366 518.1891 628.2501 631.1438 663.6435 674.1273 735.8523 756.8793 769.0544 796.9687 821.7458 851.7822 864.5445 884.2876 898.0612 985.7256 994.6857 999.2270 1006.0202 1026.8236 1031.8685 1066.2496 1093.6333 1103.7948 1126.1628 1129.6995 1147.1170 1180.4159 1198.8491 1217.4728 1223.3225 1236.1534 1268.0921 1276.8853 1283.5452 1302.4696 1305.0820 1343.0743 1363.7031 1383.1696 1391.3017 1402.5820 1418.9491 1451.2348 1472.5781 1476.7832 1477.8541 1481.7709 1482.8073 1490.0652 1498.6866 1594.8355 1608.3707 2849.6949 2858.6361 2968.4151 2975.6149 2986.6517 2995.8982 3008.8426 3036.5396 3061.2055 3072.2634 3077.5290 3135.8094 3139.2947 3180.4578 3182.8251 3421.1084
redmass: 4.0741 5.4000 2.1922 2.3087 7.4615 4.0757 2.1636 2.1987 4.9167 4.1969 1.2346 3.8831 4.3250 2.8551 6.2382 3.5107 2.8991 3.8608 6.9218 3.3526 6.8409 5.4889 1.5631 3.1065 4.5979 1.0787 6.3117 1.1566 4.3212 1.2470 1.7764 1.2116 1.6493 1.3448 1.3712 2.5305 3.0308 3.2894 1.8175 2.5083 3.3109 1.3301 2.0181 1.3005 3.7901 1.3272 1.5819 2.3063 6.2531 1.3431 1.2264 1.2568 1.1040 1.2740 1.3774 1.3918 7.4928 1.3898 1.2529 8.5743 3.3230 1.2218 1.0699 1.1465 1.0495 1.8790 1.1684 1.0920 1.0862 7.6478 6.3409 1.0712 1.0711 1.0652 1.0365 1.0645 1.0842 1.0843 1.0982 1.1007 1.1008 1.0991 1.0905 1.0907 1.0942 1.0953 1.0739
irintensity: 0.3231 1.1753 0.6572 0.9043 0.0123 1.0079 4.7015 4.3658 0.2899 1.1977 0.1491 0.1580 2.0256 0.3611 1.8132 2.5329 0.0117 6.3328 0.8031 21.2882 0.2953 2.6450 103.6005 15.1125 11.8259 7.3686 15.9844 1.5867 8.0146 0.4388 50.7054 5.0660 2.7814 4.0935 0.0286 2.3806 3.4914 10.3305 3.2289 4.7981 21.8273 36.2265 5.2055 47.0541 87.5147 73.3174 1.1505 4.5822 319.6714 4.2246 4.6833 0.5261 0.8744 1.9897 8.5757 28.2749 96.2674 5.8008 7.6508 1.5304 45.2395 35.8153 6.0866 4.0870 12.4628 7.9821 4.7717 7.0399 9.8554 2.2806 73.6947 54.8228 143.8802 28.7383 34.6517 20.0443 35.1385 35.1197 12.6622 20.6481 78.7962 49.2397 12.9409 8.0441 0.0665 4.0414 1.6711
temp: 298.150 k
press: 1.00000 atm
elementType: 8 8 7 7 6 6 6 6 6 6 6 6 6 6 6 1 1 1 1 1 1 1 1 1 1 1 1 1 1 1 1
symmnumber: 1
zpe: 670769.0 jmol-1
zpe.correction: 0.255482 hartree
zpe.thermalcorrener: 0.270217 hartree
zpe.thermalcorrenthalpy: 0.271161 hartree
zpe.thermalcorrgfe: 0.211774 hartree
zpe.sumelectzpe: -687.486612 hartree
zpe.sumelectthermal: -687.471878 hartree
zpe.sumelectthermalent: -687.470933 hartree
zpe.sumelectthermalfe: -687.530320 hartree
dipole: -6.2150 1.2150 1.0097
dipole: 6.4126
quadrupole: -121.2697 -84.9529 -92.4924
quadrupole: -1.0108 7.8654 0.3406
quadrupole: -21.6980 14.6188 7.0792 -1.0108 7.8654 0.3406
hfenergy: -687.7420941 hartree
pointgroup: C01 [X(C11H16N2O2)]
dipole: -2.4481522 -0.3861425 -0.471734 debye
polarizability: 224.478983|0.6832245|134.7016054|19.6008348|2.7287027|93.0298006 unknown
InChI: InChI=1S/C11H16N2O2/c1-2-8-12-9-7-10-3-5-11(6-4-10)13(14)15/h3-6,12H,2,7-9H2,1H3
charge 0 multiplicity 1
31 atoms
O  4.964678 1.216733 0.7398
O  5.030868 -1.062785 0.691869
N  -3.484799 -0.109656 -0.452484
N  4.420184 0.064219 0.526757
C  -2.079165 -0.137312 -0.010691
C  -1.124232 -0.05728 -1.234423
C  -4.48535 -0.028548 0.635611
C  0.332663 -0.026922 -0.813392
C  -5.918584 0.016714 0.069655
C  0.987754 1.209516 -0.563156
C  1.058462 -1.232273 -0.612108
C  -6.987522 0.121234 1.178143
C  2.324292 1.252131 -0.123519
C  2.396073 -1.215064 -0.173698
C  3.012119 0.032959 0.066996
H  -1.906379 0.741191 0.641458
H  -1.817254 -1.03998 0.598031
H  -1.392154 0.847684 -1.808569
H  -1.314223 -0.930922 -1.889056
H  -4.405029 -0.876761 1.363295
H  -4.289866 0.899171 1.210065
H  -3.696769 -0.885195 -1.097227
H  -5.995184 0.876304 -0.622727
H  -6.102021 -0.895891 -0.535475
H  0.441992 2.146913 -0.720342
H  0.56908 -2.193067 -0.809212
H  -6.939001 -0.744205 1.865896
H  -6.846036 1.038177 1.780562
H  -8.00521 0.154336 0.749135
H  2.841089 2.195914 0.069608
H  2.967326 -2.134135 -0.0185
