program: Gaussian 09
title: 000220585
version: EM64L-G09RevD.01
frameworkgroup: C1[X(C15H15NO3S)]
method: RPBEPBE
basis: SDD
operation: Freq
keyword: #p
keyword: freq=noraman
keyword: PBEPBE/SDD
title: #p freq=noraman PBEPBE/SDD
converged: YES YES NO NO
title: Mulliken charges:
elementType: S O O O N C C C C C C C C C C C C C C C H H H H H H H H H H H H H H H
charge: 0.958448 -0.523094 -0.518436 -0.228025 -0.563377 -0.080239 0.395333 -0.262013 -0.218489 0.452493 -0.514255 0.328554 -0.343618 -0.379415 -0.328560 -0.357651 -0.226010 -0.797432 0.131358 -0.786492 0.297778 0.286331 0.283196 0.277132 0.246095 0.245310 0.295831 0.245454 0.235630 0.245142 0.233778 0.230200 0.240542 0.236786 0.261716
chargesum: 0.00000
title: Mulliken charges with hydrogens summed into heavy atoms:
elementType: S O O O N C C C C C C C C C C C C C C C
charge: 0.958448 -0.523094 -0.518436 -0.228025 -0.265600 -0.080239 0.395333 0.024318 0.064707 0.452493 -0.237123 0.328554 -0.097523 -0.134105 -0.032729 -0.112197 0.009620 -0.088312 0.131358 -0.047448
polarizability: 2.43756632e+02 9.38857565e+00 2.19832039e+02 2.99843148e+01 -8.94696703e+00 1.80123390e+02
1716.lowfreq: -10.8503 -1.4822 -0.0010 0.0012 0.0021 6.9392 15.3973 17.4657 25.6937
frequency: 14.9709 17.3457 25.2697 36.1697 50.2094 72.5219 90.5590 131.4306 134.9412 147.0868 150.8971 166.0286 198.0989 223.3672 232.8927 265.0449 298.4526 311.8707 342.3180 378.8502 394.0655 405.2324 406.7266 420.6293 435.9045 482.5666 502.4084 506.9817 565.8005 570.8662 580.2791 620.8525 640.1834 691.9153 701.2331 705.6294 764.7783 777.3516 808.7292 822.2420 825.6903 846.7465 876.3465 919.3689 930.6761 959.6909 960.8933 968.1260 981.5830 984.7221 989.5055 990.7854 995.0388 1026.6518 1047.7393 1050.0597 1076.0915 1100.0936 1119.6603 1182.6034 1185.3447 1209.3464 1218.5849 1244.0548 1283.3712 1296.8528 1313.1356 1369.5559 1380.2836 1391.3349 1394.8565 1401.3330 1432.3082 1446.8071 1461.4478 1470.2019 1470.4939 1473.6309 1476.1585 1575.9984 1585.0062 1591.6837 1593.7266 1610.7377 2982.2110 2986.3605 3064.2883 3070.9711 3094.4285 3126.1602 3132.2755 3136.5357 3140.1731 3140.5106 3159.6963 3161.8529 3167.1555 3181.5269 3408.2625
redmass: 4.9730 5.8238 1.0300 3.9378 4.1548 5.6427 5.9221 6.0748 4.3863 1.0555 6.5688 5.8461 7.9724 6.8795 5.6061 5.4072 4.9141 4.7344 3.9998 3.7012 8.0891 3.3769 2.8724 3.3443 8.6799 3.2184 3.1345 3.5875 5.6718 4.4946 6.0328 6.9513 3.4814 1.9571 4.6038 3.6196 1.8421 3.8721 2.1081 2.2228 1.7086 1.2450 4.5627 1.4413 1.4493 4.6061 1.4447 1.9528 1.3975 5.6532 2.7240 1.4306 1.8794 1.8557 2.4305 1.5993 1.9902 1.6336 1.2869 1.1606 1.1426 1.8996 2.9897 1.5136 4.0855 1.2651 1.3104 1.2455 5.4443 3.0746 7.9122 1.2381 2.8067 1.1019 1.0497 1.1306 2.1702 2.3523 1.0718 6.2172 6.0027 6.7360 6.0832 7.3326 1.0388 1.0375 1.0952 1.0968 1.0999 1.0992 1.0914 1.0887 1.0893 1.0873 1.0961 1.0941 1.0964 1.0970 1.0760
irintensity: 1.1619 1.8828 0.4104 0.7641 3.0335 4.3548 2.8387 1.2281 0.3810 0.4868 0.8719 4.3304 5.0953 9.5394 0.1234 8.0965 0.3511 1.8630 6.9555 2.0073 18.2862 12.9510 0.5129 2.5710 105.0055 18.4858 89.0239 10.5927 1.8270 27.3343 22.5959 0.2501 5.6399 23.7421 14.2991 6.1768 49.8210 15.3857 58.0143 148.2546 17.8631 0.5961 35.8997 3.9081 16.9728 42.9714 10.1657 8.4503 0.3430 0.9793 2.3301 0.9546 5.6301 0.8632 25.0669 11.8556 0.2842 13.7754 7.7991 15.8457 9.3937 32.0940 6.0757 5.5064 225.4171 2.9110 4.8219 58.8176 1.2191 9.7609 3.0124 17.2208 72.2797 24.1699 20.6711 15.0638 22.9114 6.1314 14.3585 89.2390 18.7066 2.5785 9.2668 35.2421 20.5181 2.6638 18.4945 10.8215 13.9959 17.7957 6.4289 10.2604 6.9471 6.7697 4.9947 12.8450 5.6377 2.8709 17.7661
temp: 298.150 k
press: 1.00000 atm
elementType: 16 8 8 8 7 6 6 6 6 6 6 6 6 6 6 6 6 6 6 6 1 1 1 1 1 1 1 1 1 1 1 1 1 1 1
symmnumber: 1
zpe: 692359.3 jmol-1
zpe.correction: 0.263706 hartree
zpe.thermalcorrener: 0.283967 hartree
zpe.thermalcorrenthalpy: 0.284911 hartree
zpe.thermalcorrgfe: 0.211215 hartree
zpe.sumelectzpe: -1257.470697 hartree
zpe.sumelectthermal: -1257.450435 hartree
zpe.sumelectthermalent: -1257.449491 hartree
zpe.sumelectthermalfe: -1257.523188 hartree
dipole: 1.5194 5.8952 2.6939
dipole: 6.6573
quadrupole: -115.8577 -134.5754 -123.0716
quadrupole: -20.9038 12.7011 4.1924
quadrupole: 8.6439 -10.0738 1.4300 -20.9038 12.7011 4.1924
hfenergy: -1257.7344024 hartree
pointgroup: C01 [X(C15H15N1O3S1)]
dipole: 0.970673 -2.0359214 -1.3314928 debye
polarizability: 250.3316047|-1.2666583|221.0122988|-22.7741363|-5.4175805|172.3681573 unknown
InChI: InChI=1S/C15H15NO3S/c1-11-6-8-15(9-7-11)20(18,19)16-14-5-3-4-13(10-14)12(2)17/h3-10,16H,1-2H3
charge 0 multiplicity 1
35 atoms
S  -2.148644 1.769699 0.643109
O  -3.248998 2.073787 1.795827
O  -1.937723 2.702704 -0.667202
O  3.122223 -1.76436 2.12662
N  -0.476424 1.848975 1.605464
C  -2.39335 -0.008289 0.048889
C  0.704696 1.490724 0.903632
C  -3.094805 -0.890881 0.888052
C  -1.875676 -0.374652 -1.203776
C  -2.756242 -2.647688 -0.812514
C  1.497296 0.38749 1.30648
C  2.729292 0.108337 0.66198
C  -3.273489 -2.216809 0.439799
C  -2.066495 -1.709772 -1.625245
C  1.130612 2.301426 -0.190417
C  3.141381 0.915708 -0.431567
C  2.33425 1.99657 -0.855404
C  -2.932316 -4.085659 -1.262882
C  3.540683 -1.057737 1.162784
C  4.8722 -1.371554 0.490319
H  -0.651592 1.32264 2.479058
H  -3.512709 -0.541877 1.83811
H  -1.368928 0.361125 -1.836018
H  1.191052 -0.265928 2.133115
H  -3.82556 -2.924939 1.068344
H  -1.677499 -2.022864 -2.600556
H  0.517978 3.157411 -0.486924
H  4.084912 0.711535 -0.947619
H  2.656503 2.62203 -1.694642
H  -2.187983 -4.743469 -0.774234
H  -3.932203 -4.472631 -0.998494
H  -2.800855 -4.190373 -2.35314
H  5.564136 -0.511568 0.558824
H  4.731959 -1.598635 -0.582981
H  5.328317 -2.241779 0.985611
