program: Gaussian 09
title: 000220563
version: EM64L-G09RevD.01
frameworkgroup: C1[X(C10H14N2O2)]
method: RPBEPBE
basis: SDD
operation: Freq
keyword: #p
keyword: freq=noraman
keyword: PBEPBE/SDD
title: #p freq=noraman PBEPBE/SDD
converged: YES YES NO NO
title: Mulliken charges:
elementType: O O N N C C C C C C C C C C H H H H H H H H H H H H H H
charge: -0.205412 -0.208327 -0.282620 0.012244 -0.548649 -0.367919 0.434424 0.167656 -0.324654 -0.376415 -0.354439 -0.231507 -0.687358 -0.220892 0.233411 0.228986 0.223388 0.208816 0.249649 0.207941 0.183591 0.248565 0.281646 0.237746 0.205783 0.230289 0.211635 0.242421
chargesum: 0.00000
title: Mulliken charges with hydrogens summed into heavy atoms:
elementType: O O N N C C C C C C C C C C
charge: -0.205412 -0.208327 -0.032971 0.012244 -0.086252 0.064285 0.434424 0.167656 0.066878 -0.127850 -0.072793 0.006239 -0.039651 0.021529
polarizability: 1.76607261e+02 6.51969745e+00 1.45249036e+02 1.20054967e+01 -7.42670983e-01 7.97480164e+01
1716.lowfreq: -9.7445 -5.8136 -0.0008 0.0005 0.0007 2.9520 24.2257 37.2674 55.1083
frequency: 23.9522 37.0725 55.0252 72.8492 97.8130 130.1601 152.0169 178.6421 239.7427 244.6198 261.6599 338.5111 361.5193 392.3291 422.6818 435.2042 525.2307 529.4728 592.2450 648.8135 671.6477 689.9800 737.5384 768.6028 783.8016 797.7696 812.6550 830.8027 888.5543 908.2332 972.4615 999.6972 1010.0711 1020.2383 1041.7698 1053.4673 1063.3245 1113.2828 1114.3129 1146.8201 1150.3661 1176.7317 1203.8200 1213.6525 1214.2650 1254.7774 1275.7274 1284.8983 1295.6001 1332.9237 1360.0292 1378.2864 1387.9293 1389.9239 1433.9362 1450.2350 1470.2076 1471.9129 1473.8128 1480.3659 1485.6554 1499.0693 1577.7739 1609.7062 2863.7175 2902.6112 2979.3553 2997.4928 3001.6916 3013.6745 3072.1673 3077.7263 3092.4765 3132.4395 3149.1979 3165.7039 3185.1109 3414.7195
redmass: 3.9951 4.4365 2.9695 2.5140 3.8431 4.1351 2.5563 3.1302 4.4257 1.1789 6.2268 3.9355 3.4408 5.1382 3.2257 3.3894 3.5714 5.1190 4.6516 6.9038 4.9415 1.4568 3.5599 5.0906 1.4824 1.1778 1.1417 4.1133 1.4076 1.7676 1.3859 1.3463 1.8235 3.7333 2.8289 2.3853 3.1376 2.0145 1.5598 2.7352 1.7187 1.0880 3.1689 4.6640 1.5554 1.2111 1.2493 1.3256 1.2957 1.2943 5.6960 1.3703 3.0152 1.6085 2.3512 1.1705 1.7608 1.2721 1.1513 1.0660 1.0800 1.0863 6.3786 6.7497 1.0715 1.0677 1.0372 1.0875 1.0904 1.0590 1.0982 1.1033 1.1003 1.0874 1.0911 1.0956 1.0974 1.0738
irintensity: 1.3014 0.3211 1.9705 1.5908 1.0981 0.9556 1.0532 2.0530 0.5396 0.8902 2.0104 1.7192 0.9430 1.3460 0.9362 0.7735 12.0106 3.2311 9.5709 8.3702 29.2304 57.8818 28.6603 15.7844 48.0078 14.6743 3.9680 7.1772 0.3122 3.3462 3.5844 0.5873 3.4032 1.8453 1.9879 20.0995 8.2020 4.9141 10.4688 36.0492 51.9512 8.8898 98.8415 133.4467 4.2552 3.9663 3.6961 0.9412 6.3432 23.4492 150.7305 18.1809 0.4792 13.6975 8.9119 33.5095 48.3062 5.5897 3.3611 11.6116 2.2632 5.5263 14.6098 14.4063 104.2880 87.7345 33.3297 21.7185 33.3603 22.3722 54.0908 19.3223 38.3945 3.4597 12.1830 13.3942 7.6111 1.1663
temp: 298.150 k
press: 1.00000 atm
elementType: 8 8 7 7 6 6 6 6 6 6 6 6 6 6 1 1 1 1 1 1 1 1 1 1 1 1 1 1
symmnumber: 1
zpe: 598636.9 jmol-1
zpe.correction: 0.228009 hartree
zpe.thermalcorrener: 0.242016 hartree
zpe.thermalcorrenthalpy: 0.242960 hartree
zpe.thermalcorrgfe: 0.185108 hartree
zpe.sumelectzpe: -648.258753 hartree
zpe.sumelectthermal: -648.244746 hartree
zpe.sumelectthermalent: -648.243802 hartree
zpe.sumelectthermalfe: -648.301654 hartree
dipole: -0.6135 -4.0451 -0.7202
dipole: 4.1542
quadrupole: -75.4438 -88.2621 -84.3595
quadrupole: 10.4647 0.8801 0.7674
quadrupole: 7.2446 -5.5736 -1.6710 10.4647 0.8801 0.7674
hfenergy: -648.486762 hartree
pointgroup: C01 [X(C10H14N2O2)]
dipole: -0.2998891 -1.5704009 -0.3393838 debye
polarizability: 177.2714094|4.9813361|144.8312292|11.1151951|1.2362845|79.5016749 unknown
InChI: InChI=1S/C10H14N2O2/c1-2-11-8-7-9-5-3-4-6-10(9)12(13)14/h3-6,11H,2,7-8H2,1H3
charge 0 multiplicity 1
28 atoms
O  -2.133992 2.789723 0.177936
O  0.058096 2.19384 0.091547
N  3.088753 -0.258928 0.244407
N  -1.200754 1.897493 0.112923
C  0.703958 -0.435594 0.890074
C  1.721717 -0.446696 -0.282455
C  -0.727792 -0.590273 0.406647
C  -1.610301 0.469332 0.042185
C  4.161769 -0.386377 -0.769399
C  -1.260186 -1.904117 0.301261
C  -2.938246 0.238797 -0.395817
C  -2.571135 -2.155489 -0.151671
C  5.542188 -0.141827 -0.135856
C  -3.418382 -1.077335 -0.503478
H  0.837049 0.50519 1.451238
H  0.957992 -1.273082 1.564308
H  1.425986 0.327767 -1.028903
H  1.681928 -1.429567 -0.792849
H  3.165577 0.638607 0.746772
H  4.11919 -1.414375 -1.180947
H  4.019675 0.30983 -1.634134
H  -0.61687 -2.743155 0.590049
H  -3.566351 1.099139 -0.641041
H  -2.934386 -3.186315 -0.223374
H  5.618717 0.886276 0.267567
H  5.71374 -0.849033 0.694399
H  6.345937 -0.269645 -0.883152
H  -4.439174 -1.261286 -0.852636
