program: Gaussian 09
title: 000220562
version: EM64L-G09RevD.01
frameworkgroup: C1[X(C11H16N2O2)]
method: RPBEPBE
basis: SDD
operation: Freq
keyword: #p
keyword: freq=noraman
keyword: PBEPBE/SDD
title: #p freq=noraman PBEPBE/SDD
converged: YES YES NO NO
title: Mulliken charges:
elementType: O O N N C C C C C C C C C C C H H H H H H H H H H H H H H H H
charge: -0.205630 -0.208332 -0.283010 0.012377 -0.551109 -0.367127 0.435758 -0.328528 -0.375757 0.167552 -0.377185 -0.679880 -0.355601 -0.231909 -0.220828 0.232655 0.228883 0.221851 0.208778 0.201630 0.175900 0.246167 0.188045 0.218096 0.248539 0.208104 0.209442 0.219200 0.281804 0.237745 0.242367
chargesum: 0.00000
title: Mulliken charges with hydrogens summed into heavy atoms:
elementType: O O N N C C C C C C C C C C C
charge: -0.205630 -0.208332 -0.036843 0.012377 -0.089570 0.063503 0.435758 0.049002 0.030385 0.167552 -0.128646 -0.043133 -0.073797 0.005836 0.021539
polarizability: 1.92027092e+02 6.78922837e+00 1.53800762e+02 1.50978242e+01 -5.66651564e-01 9.05471555e+01
1716.lowfreq: -10.8457 -4.8782 -0.0006 -0.0005 -0.0004 5.4879 21.9083 38.1945 50.0812
frequency: 21.8895 38.1552 50.0463 55.5184 86.3335 109.2675 132.9303 144.6756 168.1989 221.4831 223.4154 259.5639 266.3067 356.0886 382.2680 395.3201 426.7380 444.9869 523.9129 530.1810 597.6106 649.0611 671.9398 697.9965 737.2686 757.4394 768.7180 783.7635 798.8824 833.0017 886.3299 888.7208 898.3715 972.7540 997.1307 999.6653 1023.9308 1028.2529 1050.8242 1063.4279 1067.6816 1115.7731 1126.8224 1140.7228 1149.8609 1176.6441 1202.8525 1205.1017 1213.3557 1238.5430 1267.0232 1276.3259 1282.4810 1294.6833 1305.5802 1343.3905 1360.4600 1382.2906 1388.4584 1391.3513 1433.9041 1452.8692 1470.6223 1471.9490 1474.7277 1478.4927 1481.4987 1486.2592 1497.1081 1577.7917 1609.7574 2854.9752 2902.0683 2969.3424 2975.2385 2992.3700 3001.2670 3012.9478 3036.9171 3071.9683 3076.5982 3076.7338 3132.6433 3149.1559 3165.7006 3185.1691 3411.7683
redmass: 5.0466 4.7791 2.3703 3.1207 3.2618 3.5434 2.4568 3.0130 2.7361 1.2238 3.7591 6.4728 3.4029 4.0571 4.6500 3.3532 3.5470 3.9215 3.5936 5.0665 4.8229 6.8470 5.1693 1.3611 3.4245 1.0801 5.2767 1.4881 1.2174 4.4025 1.2028 1.4634 1.6391 1.3819 2.4079 1.3609 2.4276 3.5266 2.1742 3.1085 2.4875 1.5475 2.0279 4.1271 1.5111 1.0918 2.1601 1.9862 4.9200 1.3128 1.2448 1.2992 1.0984 1.3221 1.3513 1.3849 5.7910 1.4924 5.1391 1.2476 2.3664 1.2082 1.6965 1.3480 1.1208 1.0448 1.0747 1.0834 1.0859 6.3878 6.7453 1.0708 1.0676 1.0656 1.0367 1.0839 1.0905 1.0588 1.0984 1.1008 1.0994 1.1030 1.0873 1.0911 1.0957 1.0973 1.0738
irintensity: 1.5074 0.2041 1.3758 0.3540 1.2121 1.2858 1.6374 1.1245 1.5990 0.2966 0.0192 2.3674 1.1330 0.9291 0.6630 1.2287 0.9197 2.1378 14.0177 1.3079 6.1829 8.0666 24.0751 65.9705 32.0385 6.6651 15.0212 48.0529 14.5065 4.8162 2.6280 1.2015 2.7785 3.2468 3.4812 0.5901 0.4835 1.3643 15.0254 8.4954 3.9440 27.1606 5.5305 63.3083 9.8339 8.0812 59.0809 37.8449 137.9466 4.1035 0.7398 3.4705 0.9581 6.1448 4.7963 9.6537 160.8946 9.2217 3.4025 8.0773 9.1411 42.4650 31.6213 4.5746 8.7885 12.8612 5.9243 7.6093 8.3945 14.6024 14.9405 99.0183 85.6490 25.5928 35.4033 38.8336 29.1907 22.2545 12.7130 74.3349 47.3029 26.4529 3.4021 12.2155 13.5966 7.5966 1.1431
temp: 298.150 k
press: 1.00000 atm
elementType: 8 8 7 7 6 6 6 6 6 6 6 6 6 6 6 1 1 1 1 1 1 1 1 1 1 1 1 1 1 1 1
symmnumber: 1
zpe: 671832.5 jmol-1
zpe.correction: 0.255887 hartree
zpe.thermalcorrener: 0.271304 hartree
zpe.thermalcorrenthalpy: 0.272249 hartree
zpe.thermalcorrgfe: 0.210853 hartree
zpe.sumelectzpe: -687.481723 hartree
zpe.sumelectthermal: -687.466307 hartree
zpe.sumelectthermalent: -687.465362 hartree
zpe.sumelectthermalfe: -687.526758 hartree
dipole: -0.5201 -4.0397 -0.6873
dipole: 4.1306
quadrupole: -81.4155 -94.5766 -90.9774
quadrupole: 12.5247 2.0847 1.0638
quadrupole: 7.5743 -5.5867 -1.9876 12.5247 2.0847 1.0638
hfenergy: -687.7376109 hartree
pointgroup: C01 [X(C11H16N2O2)]
dipole: 0.2475316 1.5723282 -0.3278279 debye
polarizability: 192.6856314|5.2786361|153.4699976|-14.0813828|-1.4063868|90.2193806 unknown
InChI: InChI=1S/C11H16N2O2/c1-2-8-12-9-7-10-5-3-4-6-11(10)13(14)15/h3-6,12H,2,7-9H2,1H3
charge 0 multiplicity 1
31 atoms
O  2.637561 -2.771141 0.105174
O  0.437072 -2.202729 0.151414
N  -2.612017 0.203555 0.467293
N  1.691188 -1.890473 0.099911
C  -0.198684 0.4173 0.985446
C  -1.277642 0.412919 -0.1308
C  1.203281 0.590652 0.426783
C  -3.738224 0.301109 -0.489969
C  -5.088186 0.067884 0.216958
C  2.078329 -0.456891 0.012613
C  1.712789 1.911369 0.297572
C  -6.284732 0.146942 -0.75507
C  3.37827 -0.208197 -0.494163
C  2.994866 2.180649 -0.222649
C  3.835745 1.114194 -0.622137
H  -0.288253 -0.52459 1.553442
H  -0.427171 1.251996 1.672217
H  -1.010243 -0.357279 -0.892224
H  -1.28045 1.396065 -0.64225
H  -3.726087 1.318875 -0.930001
H  -3.642669 -0.417254 -1.344193
H  -2.644423 -0.692582 0.97701
H  -5.075472 -0.928728 0.705788
H  -5.196332 0.815073 1.025734
H  1.074944 2.741234 0.622693
H  -6.33722 1.139132 -1.241916
H  -6.202191 -0.615322 -1.552634
H  -7.240687 -0.01938 -0.226361
H  4.003143 -1.059872 -0.775222
H  3.341011 3.216157 -0.309673
H  4.834487 1.311833 -1.023683
