program: Gaussian 09
title: 000220553
version: EM64L-G09RevD.01
frameworkgroup: C1[X(C17H27N)]
method: RPBEPBE
basis: SDD
operation: Freq
keyword: #pfreq=noraman
keyword: PBEPBE/SDD
title: #p freq=noraman PBEPBE/SDD
converged: YES YES NO NO
title: Mulliken charges:
elementType: N C C C C C C C C C C C C C C C C C H H H H H H H H H H H H H H H H H H H H H H H H H H H
charge: -0.151510 -0.368419 -0.372711 -0.377940 -0.352120 -0.467980 -0.355946 -0.177957 -0.696702 -0.380951 0.548357 0.398343 -0.440916 -0.432108 -0.374758 -0.359517 -0.646592 -0.648052 0.192743 0.187228 0.187634 0.191258 0.211048 0.193137 0.186825 0.187690 0.193515 0.204406 0.195217 0.194306 0.213755 0.209617 0.209492 0.214612 0.221372 0.220692 0.217817 0.232979 0.231799 0.214571 0.232818 0.232721 0.232870 0.232429 0.214930
chargesum: 0.00000
title: Mulliken charges with hydrogens summed into heavy atoms:
elementType: N C C C C C C C C C C C C C C C C C
charge: -0.151510 0.011551 0.006180 0.026245 0.022395 -0.070059 0.033578 0.035798 -0.062982 -0.159579 0.548357 0.398343 -0.220224 -0.214292 -0.141779 -0.127718 0.033518 0.032177
polarizability: 3.55434610e+02 -1.28790958e+01 1.69386078e+02 2.76237066e+01 1.20781161e+01 1.34593861e+02
1716.lowfreq: -3.2573 -0.0010 -0.0001 0.0008 3.2934 11.7766 15.4733 22.5023 33.3351
frequency: 14.2293 22.4595 33.2941 46.8520 60.1000 75.8442 83.3823 85.8637 97.1675 113.5845 128.7731 141.6972 152.3991 184.8226 197.9469 206.7571 231.8674 236.0295 251.0855 313.6129 323.2089 382.5387 393.5195 411.6977 421.2443 465.3830 474.3208 493.5090 529.2211 569.3914 636.8268 711.8687 719.2731 728.1275 733.3147 756.3822 799.1325 805.6761 814.3547 838.7809 848.3850 887.7413 906.4652 938.4197 944.8566 951.8160 977.7054 979.9986 992.1284 998.0699 1019.4168 1033.8864 1053.4546 1056.7629 1073.1319 1080.1228 1109.6119 1110.3460 1114.5720 1121.7677 1142.2085 1166.7837 1187.2614 1199.9492 1213.8729 1226.5764 1237.7625 1256.6396 1263.4022 1263.8218 1277.8540 1285.7563 1290.6435 1293.0847 1303.3020 1315.2695 1331.6645 1342.3604 1349.9340 1353.3457 1362.0869 1381.7334 1387.8078 1428.2258 1442.8090 1456.1294 1459.9892 1461.4440 1463.0466 1463.3030 1468.1834 1473.9564 1475.6009 1476.7775 1482.8943 1487.9864 1494.1035 1507.4215 1529.3059 1558.1508 1633.1043 1662.6044 2933.1727 2941.1879 2942.0132 2949.1775 2949.4721 2955.9490 2964.5555 2967.7394 2970.7319 2983.1598 2992.2608 2996.5170 2999.3009 3002.5709 3012.6211 3029.2458 3041.9752 3065.2212 3067.1247 3069.4615 3078.5507 3093.1419 3102.6215 3111.8317 3126.9665 3159.4042 3163.5452
redmass: 3.6534 3.8620 1.8669 2.8905 3.5037 2.4004 2.6561 2.2626 1.9877 2.8194 1.7732 2.2509 2.0070 3.4961 2.4289 1.1104 1.1177 2.9912 2.2961 4.0483 2.9033 3.1085 3.6575 3.4553 2.9841 3.0145 3.3952 3.0935 2.3394 3.6308 7.0366 3.2223 1.0710 1.1461 2.8354 1.2174 1.5401 1.3076 1.7849 2.3469 1.8307 1.8858 1.3377 1.3765 3.0893 1.3574 1.9996 1.1763 2.3715 2.4116 2.5240 2.8814 1.8853 1.4864 2.4813 2.1771 1.3154 1.2416 2.1566 1.9037 1.6434 1.7099 1.7037 1.1873 1.2722 1.3795 1.6847 1.3383 1.3153 2.5862 1.0602 1.1054 1.1421 1.3019 1.3608 1.4943 1.4072 1.5376 1.5793 1.6869 3.3164 3.7990 1.2181 1.3976 2.2248 1.0892 1.2130 1.0739 1.0702 1.0419 1.0799 1.0461 1.0794 1.0429 1.0845 1.0897 1.0913 1.1139 2.5951 6.3162 6.1506 5.9979 1.0370 1.0522 1.0493 1.0590 1.0589 1.0593 1.0603 1.0594 1.0365 1.0965 1.0983 1.0991 1.1028 1.0971 1.1023 1.1041 1.1040 1.0912 1.1007 1.0993 1.0874 1.0955 1.0936 1.0891 1.0875 1.0930 1.0938
irintensity: 0.1718 0.4888 0.0723 0.9813 0.9408 0.0291 0.0597 1.6565 2.9249 0.3375 0.0311 0.1675 0.0432 0.1757 0.2672 0.0161 0.0042 0.6598 3.3342 1.3057 1.7029 1.0930 0.4307 0.2703 0.0432 1.5728 3.1373 2.7286 12.2136 3.8279 0.3568 0.6601 13.0138 0.4388 1.2159 4.8619 19.9494 0.5322 60.5360 1.5225 4.6229 5.0930 4.9923 3.5877 27.8920 0.0118 4.9768 50.5771 1.1436 0.4484 0.8378 1.6703 11.9256 25.7333 1.5174 0.2094 1.1417 0.0353 8.7426 6.4771 3.9851 12.7924 0.6010 44.8582 3.4553 0.8002 1.2406 5.3405 4.1735 29.9525 0.4956 0.4178 1.4081 8.2686 2.1787 7.2848 3.1195 0.9141 1.3959 0.8941 177.8392 4.8842 11.2586 7.7055 2.7706 3.4498 17.5017 0.0351 0.5652 0.4103 1.1107 20.7331 2.4669 12.1452 3.5422 25.4350 1.3666 36.7002 290.4100 3.4349 260.1820 0.3525 119.5388 139.3459 34.0811 4.4692 0.1444 16.1952 1.3338 181.4204 40.9500 1.6229 2.3326 4.7951 94.2212 5.5473 1.3711 9.1476 150.4997 7.3710 96.6304 56.0821 66.4744 4.9107 53.0509 21.3191 13.0070 32.4756 13.0043
temp: 298.150 k
press: 1.00000 atm
elementType: 7 6 6 6 6 6 6 6 6 6 6 6 6 6 6 6 6 6 1 1 1 1 1 1 1 1 1 1 1 1 1 1 1 1 1 1 1 1 1 1 1 1 1 1 1
symmnumber: 1
zpe: 1043214.7 jmol-1
zpe.correction: 0.397339 hartree
zpe.thermalcorrener: 0.418649 hartree
zpe.thermalcorrenthalpy: 0.419593 hartree
zpe.thermalcorrgfe: 0.343771 hartree
zpe.sumelectzpe: -717.336347 hartree
zpe.sumelectthermal: -717.315038 hartree
zpe.sumelectthermalent: -717.314094 hartree
zpe.sumelectthermalfe: -717.389915 hartree
dipole: -2.6921 0.8138 -0.4164
dipole: 2.8431
quadrupole: -80.5890 -106.3176 -115.5563
quadrupole: -4.7981 4.8898 4.9393
quadrupole: 20.2320 -5.4966 -14.7354 -4.7981 4.8898 4.9393
hfenergy: -717.7336867 hartree
pointgroup: C01 [X(C17H27N1)]
dipole: 1.0569047 -0.3563023 -0.0847927 debye
polarizability: 355.281115|-20.0857454|162.5888121|-23.6003997|-18.3718645|141.5446219 unknown
InChI: InChI=1S/C17H27N/c1-4-5-6-7-8-9-10-11-16-12-14-17(15-13-16)18(2)3/h10-15H,4-9H2,1-3H3
charge 0 multiplicity 1
45 atoms
N  6.031193 -0.653656 -0.217189
C  -4.421997 0.513072 0.375899
C  -5.456588 -0.466075 -0.223492
C  -2.966253 0.007388 0.262575
C  -6.916808 0.018599 -0.076907
C  -1.930191 1.005225 0.850388
C  -7.949708 -0.956146 -0.68757
C  -0.515883 0.469698 0.832882
C  -9.407055 -0.473606 -0.521693
C  0.525925 1.042319 0.160572
C  1.922178 0.575516 0.087994
C  4.693408 -0.250504 -0.11977
C  2.869359 1.311001 -0.678112
C  2.40583 -0.589514 0.750206
C  4.215783 0.921231 -0.787256
C  3.745512 -0.996849 0.654646
C  6.978269 0.138345 -1.009033
C  6.488869 -1.85961 0.48152
H  -4.510391 1.496547 -0.131653
H  -4.663681 0.693289 1.444769
H  -5.349397 -1.456435 0.26711
H  -5.229222 -0.626883 -1.298138
H  -2.716729 -0.18804 -0.799582
H  -2.873847 -0.965614 0.788652
H  -7.147424 0.168058 0.998896
H  -7.025066 1.013513 -0.557904
H  -2.232061 1.235796 1.895601
H  -1.97932 1.960026 0.289685
H  -7.724889 -1.09598 -1.764775
H  -7.83269 -1.952808 -0.214604
H  -0.354304 -0.4579 1.404559
H  -9.557467 0.508193 -1.009544
H  -9.666337 -0.358179 0.547838
H  -10.124748 -1.186299 -0.96846
H  0.315702 1.966401 -0.401655
H  2.537244 2.216084 -1.203624
H  1.720382 -1.193142 1.356568
H  4.894973 1.528817 -1.392136
H  4.060229 -1.900181 1.1854
H  7.974894 -0.328941 -0.965439
H  7.071309 1.175646 -0.625558
H  6.676661 0.197919 -2.07533
H  5.945202 -2.765426 0.142236
H  6.357331 -1.777677 1.580472
H  7.560803 -2.015219 0.280853
