program: Gaussian 09
title: 000220560
version: EM64L-G09RevD.01
frameworkgroup: C1[X(C24H14O3)]
method: RPBEPBE
basis: SDD
operation: Freq
keyword: #pfreq=noraman
keyword: PBEPBE/SDD
title: #p freq=noraman PBEPBE/SDD
converged: NO YES NO NO
title: Mulliken charges:
elementType: O O O C C C C C C C C C C C C C C C C C C C C C C C C H H H H H H H H H H H H H H
charge: -0.215581 -0.186200 -0.186197 0.127524 0.127535 0.088664 0.088662 0.309381 0.309380 -0.253588 -0.253600 0.353680 0.353677 -0.390192 -0.390194 -0.232649 -0.232645 -0.369283 -0.369281 -0.369293 -0.369294 -0.223030 -0.223042 -0.223020 -0.223009 -0.231948 -0.231949 0.293715 0.293714 0.239998 0.239997 0.240306 0.240305 0.240279 0.240282 0.230713 0.230713 0.230716 0.230717 0.232019 0.232020
chargesum: 0.00000
title: Mulliken charges with hydrogens summed into heavy atoms:
elementType: O O O C C C C C C C C C C C C C C C C C C C C C C C C
charge: -0.215581 -0.186200 -0.186197 0.127524 0.127535 0.088664 0.088662 0.309381 0.309380 -0.253588 -0.253600 0.353680 0.353677 -0.096477 -0.096480 0.007349 0.007351 -0.128977 -0.128976 -0.129013 -0.129012 0.007683 0.007671 0.007696 0.007708 0.000071 0.000071
polarizability: 3.39806612e+02 -5.65455190e-04 3.12754509e+02 -9.13303722e-02 5.01140232e-02 1.79235636e+02
1716.lowfreq: -55.5527 -48.5598 -3.7696 -0.0005 0.0006 0.0006 3.7800 6.2066 35.8588
frequency: -55.5479 -48.5233 35.8316 40.5224 44.1684 55.1831 61.9442 121.5542 141.3599 160.1492 176.9086 223.0454 228.0369 246.3485 247.9207 289.0354 317.4779 356.7267 381.9435 396.8670 397.2933 402.9921 416.9268 426.2824 476.0953 477.2624 477.3218 522.6559 551.3224 609.1509 609.6274 648.2210 648.5200 648.9554 664.8449 689.6990 698.0796 699.2739 710.3717 726.1835 738.2231 760.7736 766.9158 788.9478 812.0019 851.1207 852.0818 854.7642 870.2799 875.4943 926.2173 928.3770 936.0551 977.7102 978.0365 983.6265 988.2691 989.3374 998.0403 998.6942 1000.6748 1005.5435 1016.1088 1027.1786 1030.5556 1037.3605 1075.3229 1076.4335 1080.6082 1081.1823 1107.7788 1171.0290 1174.6553 1174.6799 1189.3973 1190.0532 1203.3858 1228.1433 1267.1755 1270.3797 1313.3906 1314.1123 1333.4777 1372.2629 1372.4802 1388.2544 1396.3929 1430.2047 1430.7396 1435.0553 1464.1512 1472.9940 1478.3971 1548.9544 1553.4653 1581.5763 1585.3787 1585.9010 1587.6178 1588.9622 1612.4157 1627.4410 1630.5052 3128.9683 3128.9848 3135.6330 3136.8143 3136.8694 3147.1577 3147.2348 3149.1982 3157.3155 3157.4217 3158.8167 3169.7325 3169.7496 3169.9368
redmass: 3.9714 3.7214 6.0885 7.5574 5.6233 5.8995 7.2038 4.5452 5.7955 8.6829 5.1235 6.2087 4.8457 6.8760 5.9203 10.1232 6.8367 11.1300 5.0342 2.7986 2.8028 8.3941 7.1069 3.3997 8.4846 5.9812 6.3576 4.2228 4.5044 6.4355 6.5505 5.9658 6.2163 6.7195 6.7841 6.6822 1.9364 1.8008 3.9803 6.3929 2.6846 1.7896 3.2080 3.4485 1.9261 1.2811 1.2459 3.0772 8.1426 8.6640 1.4309 1.4561 1.7477 1.3931 1.3926 7.7765 6.2187 6.3743 1.4381 1.3405 1.3912 5.6829 1.3616 2.5848 2.4809 1.9489 3.9769 3.6047 1.6022 1.6007 2.5159 1.0818 1.0529 1.0529 1.1132 1.1151 2.2640 4.5624 1.7649 5.1184 1.3605 1.3572 4.3998 6.8839 6.9845 10.3279 9.8800 2.2277 2.2281 2.4394 2.5792 2.3686 2.4337 9.1460 10.2783 8.2768 5.9618 5.9782 7.7576 8.6988 6.6818 7.4012 8.1906 1.0848 1.0848 1.0860 1.0880 1.0880 1.0929 1.0929 1.0898 1.0973 1.0973 1.0946 1.1019 1.1011 1.1014
irintensity: 0.0669 0.0000 3.0715 0.0000 0.7767 0.2829 1.7122 0.0000 0.0000 1.5834 0.6387 0.0072 0.0323 0.9380 1.0972 0.4389 0.6341 24.0267 1.7213 0.0001 0.0004 0.1136 0.0001 1.8201 0.2196 0.2979 0.3954 18.2606 6.0314 0.0000 0.5350 0.0320 8.0412 2.9555 4.0182 9.8274 12.3528 73.0886 10.3691 0.0005 53.6127 105.2499 12.3781 8.6838 30.4074 0.0000 0.1000 0.0000 5.4320 122.2046 0.0006 4.3791 0.0000 0.0000 0.0530 3.4271 2.5523 2.4240 11.2194 0.0004 4.1751 107.3548 0.0000 8.7263 2.4845 5.0214 0.5381 0.1945 0.0004 17.3397 5.5514 16.1809 0.0000 0.0016 4.2183 7.5224 48.2772 165.1013 36.5216 148.0692 0.0001 1.0555 9.1233 0.0003 0.6308 39.5756 68.8586 0.0001 20.1623 3.9074 0.6864 93.9788 9.1472 11.2106 241.0069 268.8667 0.0168 2.0278 38.5516 7.4109 3.8780 93.5769 23.8704 0.4815 0.1913 3.4302 0.0003 1.5766 30.8888 8.5725 3.6721 0.0041 59.1692 1.5123 32.3953 46.6114 1.5837
temp: 298.150 k
press: 1.00000 atm
elementType: 8 8 8 6 6 6 6 6 6 6 6 6 6 6 6 6 6 6 6 6 6 6 6 6 6 6 6 1 1 1 1 1 1 1 1 1 1 1 1 1 1
symmnumber: 1
zpe: 798547.3 jmol-1
zpe.correction: 0.304151 hartree
zpe.thermalcorrener: 0.323108 hartree
zpe.thermalcorrenthalpy: 0.324052 hartree
zpe.thermalcorrgfe: 0.255840 hartree
zpe.sumelectzpe: -1146.829029 hartree
zpe.sumelectthermal: -1146.810072 hartree
zpe.sumelectthermalent: -1146.809128 hartree
zpe.sumelectthermalfe: -1146.877340 hartree
dipole: 0.0000 -0.3279 0.0009
dipole: 0.3279
quadrupole: -146.3675 -134.0538 -142.0818
quadrupole: 0.0030 -0.0285 0.0144
quadrupole: -5.5331 6.7806 -1.2475 0.0030 -0.0285 0.0144
hfenergy: -1147.1331797 hartree
pointgroup: C01 [X(C24H14O3)]
dipole: 0.0000458 -0.1290069 -0.0003329 debye
polarizability: 339.8065646|0.012913|312.7545095|-0.1224142|-0.057144|179.2356829 unknown
InChI: InChI=1S/C24H14O3/c25-21-17-13-7-8-14-18(17)22(26)20-19(21)23(15-9-3-1-4-10-15)27-24(20)16-11-5-2-6-12-16/h1-14H
charge 0 multiplicity 1
41 atoms
O  0.001132 -1.818604 0.00042
O  -2.794555 1.593448 0.001382
O  2.792655 1.596884 0.000121
C  -0.728479 0.338237 0.001548
C  0.728122 0.339128 0.001098
C  -1.150081 -0.987532 0.000928
C  1.151338 -0.986129 0.000544
C  -0.717553 2.850778 0.001078
C  0.714104 2.851657 0.000717
C  -1.522678 1.578637 0.002426
C  1.520797 1.580505 0.001369
C  -2.462722 -1.66506 0.000622
C  2.464785 -1.662094 0.000246
C  -1.4152 4.084112 0.00034
C  1.410224 4.085854 -0.00034
C  -0.712268 5.304746 -0.000721
C  0.705781 5.305618 -0.001057
C  -3.095439 -1.996942 -1.224652
C  3.097878 -1.994354 1.225224
C  -3.09895 -1.991288 1.225589
C  3.101385 -1.986498 -1.225013
C  -4.349179 -2.645307 -1.223339
C  4.352348 -2.641305 1.22333
C  -4.352679 -2.639669 1.223663
C  4.355842 -2.633469 -1.223667
C  -4.980138 -2.968144 0.000012
C  4.983669 -2.962335 -0.00031
H  -2.509546 4.052971 0.000676
H  2.504608 4.056068 -0.000588
H  -1.260262 6.252996 -0.001275
H  1.252607 6.254542 -0.00188
H  -2.609895 -1.738968 -2.171882
H  2.612041 -1.737782 2.172684
H  -2.616143 -1.728898 2.173001
H  2.618274 -1.723814 -2.172189
H  -4.833381 -2.894293 -2.17371
H  4.83683 -2.890599 2.173477
H  -4.839601 -2.88428 2.17378
H  4.843037 -2.876684 -2.174003
H  -5.954604 -3.468921 -0.000226
H  5.958698 -3.462015 -0.00052
