program: Gaussian 09
title: 000220696
version: EM64L-G09RevD.01
frameworkgroup: C1[X(C15H13N3OS)]
method: RPBEPBE
basis: SDD
operation: Freq
keyword: #p
keyword: freq=noraman
keyword: PBEPBE/SDD
title: #p freq=noraman PBEPBE/SDD
converged: NO YES NO NO
title: Mulliken charges:
elementType: S O N N N C C C C C C C C C C C C C C C H H H H H H H H H H H H H
charge: 0.189043 -0.261163 0.009751 -0.320156 0.020364 -0.306417 0.353653 -0.191497 -0.271960 -0.331594 0.462203 -0.243233 -0.212826 -0.365864 -0.375324 0.325120 -0.353695 -0.338964 -0.395681 -0.537118 0.242215 0.255913 0.228109 0.228711 0.224608 0.277976 0.252321 0.243019 0.293974 0.203047 0.224400 0.246667 0.224399
chargesum: 0.00000
title: Mulliken charges with hydrogens summed into heavy atoms:
elementType: S O N N N C C C C C C C C C C C C C C C
charge: 0.189043 -0.261163 0.009751 -0.026181 0.020364 -0.306417 0.353653 -0.191497 -0.029745 -0.075682 0.462203 -0.015125 0.015885 -0.141257 -0.097348 0.325120 -0.101374 -0.095945 -0.192634 0.158348
polarizability: 4.89428092e+02 -1.26823359e+01 2.24165135e+02 4.99783683e-03 -3.78888065e-03 8.06546542e+01
1716.lowfreq: -1.9493 -0.0020 -0.0014 0.0004 4.2160 7.1931 26.7594 30.9862 35.3178
frequency: 26.7110 30.9787 35.2743 68.6783 105.2817 116.2263 145.4868 181.3144 190.3509 195.9665 214.7298 231.3473 253.7494 309.4824 310.7493 380.2274 389.1507 394.2915 418.4954 431.1196 480.3303 489.3814 509.5976 520.5512 533.3293 566.8432 568.7243 581.1643 620.7161 629.0008 672.4456 727.4749 734.6172 734.8942 760.2123 766.8694 823.4044 836.9796 852.9237 858.7424 894.4647 926.0107 938.9773 962.2844 978.9343 979.1694 984.0555 999.6670 1012.0808 1025.8442 1035.6317 1111.7890 1113.1928 1116.0808 1145.2161 1157.2209 1168.6722 1175.7850 1228.0961 1244.7934 1248.6775 1287.7056 1307.6355 1338.2256 1371.5268 1379.6667 1427.7062 1433.6579 1438.6741 1443.8034 1468.1755 1472.8855 1499.8005 1522.8890 1559.1853 1564.4678 1582.2347 1586.7512 1621.5234 1630.8534 2956.0906 2961.8992 3051.0803 3121.4297 3128.0541 3133.8500 3147.4328 3149.2372 3162.8242 3166.8395 3170.0743 3174.5729 3392.2567
redmass: 5.0590 5.7314 4.9234 4.7977 3.8217 6.0202 5.5990 5.7712 8.3367 2.9568 1.8926 3.7266 1.7550 5.6450 5.5982 7.3509 4.2666 7.3442 3.0966 3.1971 9.5907 5.1123 5.8470 3.0611 3.1380 6.6251 1.7617 2.8722 7.8214 7.1140 7.0419 2.7968 6.2162 3.6760 1.4853 6.2453 1.2575 1.5776 5.5820 1.3776 6.2032 1.4597 1.3796 1.4137 1.3181 1.3492 8.8558 2.6092 3.1990 4.7012 4.1564 1.5616 1.2583 1.4613 2.9829 1.3390 1.0973 1.2271 2.2951 2.4318 1.8799 2.1939 1.3906 1.9364 4.3712 3.5417 3.5490 2.9778 1.2342 2.7292 1.0497 1.0822 2.1911 1.7008 6.8882 6.4620 6.8255 5.7401 6.3294 9.8439 1.0864 1.0331 1.1041 1.0896 1.0995 1.0854 1.0906 1.0876 1.0958 1.0950 1.0964 1.0992 1.0752
irintensity: 0.5892 0.7690 0.1524 0.0017 12.2485 3.9313 0.2865 0.0530 1.3635 17.8833 12.6847 0.0843 4.5579 1.6460 13.2465 13.8199 0.0095 9.1340 0.0426 8.8424 1.6827 17.7827 1.7293 0.2773 28.2567 11.6602 49.1699 23.6081 37.6173 2.2538 5.2616 14.9526 5.0593 1.2124 89.6692 26.9405 1.8821 64.1113 12.9929 1.3983 36.9275 35.5223 3.8234 5.5932 0.0360 2.1090 70.5907 10.3410 0.0809 114.0115 7.8938 91.2520 0.1886 31.1613 354.8097 1.1486 7.0267 114.5687 126.9025 112.7760 93.7029 4.0484 7.8307 35.5854 0.6516 13.1440 0.0407 19.5503 19.2842 37.1450 13.9534 88.5551 154.2649 3.3672 3.9656 125.2350 382.6075 1.5598 185.0077 511.2191 73.1674 70.3209 46.0055 14.8797 28.8307 1.7487 10.4531 5.9597 24.9624 11.2652 10.7258 19.8024 26.9381
temp: 298.150 k
press: 1.00000 atm
elementType: 16 8 7 7 7 6 6 6 6 6 6 6 6 6 6 6 6 6 6 6 1 1 1 1 1 1 1 1 1 1 1 1 1
symmnumber: 1
zpe: 650753.4 jmol-1
zpe.correction: 0.247859 hartree
zpe.thermalcorrener: 0.265360 hartree
zpe.thermalcorrenthalpy: 0.266304 hartree
zpe.thermalcorrgfe: 0.200644 hartree
zpe.sumelectzpe: -1215.490286 hartree
zpe.sumelectthermal: -1215.472785 hartree
zpe.sumelectthermalent: -1215.471841 hartree
zpe.sumelectthermalfe: -1215.537502 hartree
dipole: 1.6248 -0.6058 0.0000
dipole: 1.7341
quadrupole: -102.4426 -100.9441 -131.1964
quadrupole: 9.7037 -0.0005 -0.0004
quadrupole: 9.0851 10.5836 -19.6687 9.7037 -0.0005 -0.0004
hfenergy: -1215.7381452 hartree
pointgroup: C01[X(C15H13N3O1S1)]
dipole: -0.6494603 0.2089046 -0.000019 debye
polarizability: 490.0319765|-0.537484|223.5612508|-0.0051655|0.0035569|80.6546542 unknown
InChI: InChI=1S/C15H13N3OS/c1-19-12-8-6-11(7-9-12)10-16-18-15-17-13-4-2-3-5-14(13)20-15/h2-10,18H,1H3
charge 0 multiplicity 1
33 atoms
S  3.593144 2.074216 0.000163
O  -6.595517 -0.934974 0.000218
N  2.340749 -0.346623 0.000055
N  0.856569 1.567473 0.000146
N  -0.316302 0.833047 0.000161
C  4.583229 0.548095 0.000087
C  3.72611 -0.605129 0.000041
C  2.089504 0.940705 0.000115
C  5.984299 0.429498 0.000073
C  4.305875 -1.895412 -0.000019
C  -2.743756 0.839123 0.000188
C  6.543946 -0.87059 0.000012
C  5.710695 -2.019627 -0.000033
C  -3.941179 1.612618 0.000188
C  -2.852786 -0.579395 0.000199
C  -5.293046 -0.419333 0.000204
C  -5.201712 0.995901 0.000195
C  -4.110452 -1.209124 0.000207
C  -1.446897 1.515519 0.000179
C  -6.753678 -2.392874 0.000141
H  6.631886 1.31187 0.000107
H  3.649563 -2.770573 -0.000054
H  7.633191 -0.985108 0.000001
H  6.164718 -3.016447 -0.00008
H  -3.879234 2.70819 0.00018
H  -1.933399 -1.17377 0.000202
H  -6.126572 1.580582 0.000194
H  -4.162105 -2.302047 0.000222
H  0.8357 2.597947 0.00016
H  -1.464192 2.626219 0.000179
H  -6.304577 -2.845778 -0.905056
H  -7.840239 -2.561934 0.000098
H  -6.304636 -2.845866 0.905324
