program: Gaussian 09
title: 000220549
version: EM64L-G09RevD.01
frameworkgroup: C1[X(C16H26N2O2)]
method: RPBEPBE
basis: SDD
operation: Freq
keyword: #p
keyword: freq=noraman
keyword: PBEPBE/SDD
title: #p freq=noraman PBEPBE/SDD
converged: YES YES NO NO
title: Mulliken charges:
elementType: O O N N C C C C C C C C C C C C C C C C H H H H H H H H H H H H H H H H H H H H H H H H H H
charge: -0.214508 -0.214269 -0.100494 0.026795 -0.355884 -0.368679 -0.382038 -0.355982 -0.353269 -0.580914 -0.340081 -0.339686 0.537397 -0.692863 -0.693187 -0.378323 -0.396066 -0.360993 -0.356483 0.366555 0.195660 0.188773 0.204992 0.187571 0.210156 0.222634 0.187710 0.207871 0.183267 0.208729 0.214000 0.234732 0.192274 0.191040 0.192754 0.192058 0.209997 0.216836 0.212410 0.209528 0.217216 0.212180 0.244990 0.247847 0.283733 0.284013
chargesum: 0.00000
title: Mulliken charges with hydrogens summed into heavy atoms:
elementType: O O N N C C C C C C C C C C C C C C C C
charge: -0.214508 -0.214269 -0.100494 0.026795 0.028549 0.023885 0.050752 0.039599 0.038727 -0.132183 0.043232 0.045126 0.537397 -0.053619 -0.054263 -0.133332 -0.148219 -0.077260 -0.072471 0.366555
polarizability: 3.25795626e+02 8.21660074e+00 1.93512273e+02 -6.68831795e+00 2.25241105e+01 1.46890788e+02
1716.lowfreq: -3.6484 -0.0010 -0.0007 0.0002 3.8159 6.4838 14.3548 19.6441 31.5727
frequency: 12.3164 19.2869 31.3431 36.6065 50.7260 55.2298 63.0687 68.8848 74.4165 105.8753 114.7158 138.5785 150.9045 174.6268 192.2218 212.8777 229.4959 232.3168 270.5949 277.5954 291.2564 342.9496 349.2038 359.7337 401.7769 409.5921 432.1882 479.0509 493.9779 507.3994 522.8587 628.1059 631.7853 671.5055 731.5168 732.6427 733.7033 764.7564 785.9856 791.9531 794.4922 817.4960 832.8506 850.4537 870.0713 898.4651 899.3611 928.1744 929.8732 984.3538 992.2887 994.2727 1004.3044 1009.0406 1025.6989 1031.0751 1070.0479 1074.5685 1081.8420 1091.4957 1093.2372 1107.5631 1112.4066 1120.8567 1154.1676 1178.9966 1192.2192 1212.4643 1217.1769 1221.4869 1234.9668 1241.1062 1265.9934 1271.2200 1278.2400 1286.3197 1286.7203 1288.5616 1298.5218 1304.2958 1305.4125 1345.5729 1346.7823 1361.3823 1362.0328 1369.4089 1377.1457 1390.2739 1391.1919 1402.1616 1418.1387 1463.2570 1465.5448 1470.1718 1471.2687 1472.0214 1477.5061 1477.5478 1478.7462 1480.5848 1481.7948 1483.4738 1488.9122 1490.6629 1593.2555 1607.0179 2851.9205 2856.9301 2870.4994 2962.9124 2963.2614 2972.8193 2974.1022 2974.4557 2977.4903 2999.7341 3003.4300 3005.6448 3009.7582 3021.6024 3035.5161 3044.2087 3046.8215 3070.5635 3071.1363 3071.5277 3073.4995 3073.6511 3134.8991 3138.7290 3180.5398 3183.0490
redmass: 4.8087 4.8880 4.3825 3.5017 2.7045 3.6901 2.1176 6.4451 1.5430 2.5896 2.3742 4.8415 2.7868 2.3926 2.9538 4.6417 1.1392 1.1544 2.6811 3.3787 2.7899 3.8012 3.7260 3.2330 3.9195 2.9049 3.1858 3.0539 3.2294 6.5090 3.1962 6.8388 6.0007 4.6532 1.3484 1.1726 2.0530 5.8694 1.2250 1.2103 1.2009 5.1962 2.5218 1.2437 2.2159 1.7390 1.7431 1.2339 1.2558 1.3951 1.9892 1.5449 3.1812 3.2624 3.2183 2.3897 2.2601 2.3048 2.2092 2.0316 3.3155 1.7758 2.2845 1.5290 1.5305 1.3352 2.0507 1.5676 2.4550 4.7586 1.5002 1.4841 1.2548 1.3002 1.3675 1.1255 1.0902 1.1153 1.3015 1.2617 1.2892 1.5018 1.5210 3.5655 1.5826 1.4148 1.4089 1.2175 1.2265 8.6865 3.3231 1.0711 1.0730 1.0895 1.0706 1.1007 1.0446 1.0431 1.0738 2.3736 1.0721 1.0895 1.0882 1.0901 7.6606 6.3228 1.0709 1.0709 1.0709 1.0590 1.0590 1.0574 1.0384 1.0402 1.0594 1.0618 1.0939 1.0970 1.0916 1.0897 1.0879 1.1021 1.1006 1.1016 1.1009 1.1006 1.0995 1.0995 1.0904 1.0906 1.0942 1.0953
irintensity: 0.0530 0.7367 0.9027 0.1655 0.4465 0.9954 0.3764 0.1852 0.1184 0.0977 0.1364 1.1525 0.9381 1.4175 2.3138 1.7158 0.0448 0.0319 0.5514 3.7386 2.9705 2.0867 0.1326 0.8493 5.5780 0.0365 8.3140 5.0208 4.6306 1.5592 17.3328 0.3199 1.0613 28.6713 2.0613 10.7858 12.1864 12.8243 12.9300 0.8047 0.2061 2.4707 13.8966 0.0880 43.7006 14.5307 13.2418 12.2026 9.8953 10.0851 5.5942 2.3983 2.3191 35.3773 25.5031 3.7230 75.8252 29.9102 78.6339 30.9525 11.4330 3.4986 0.7658 32.1458 9.6596 107.3075 40.1885 22.8526 26.1130 410.4956 8.0889 6.0418 2.4082 6.2146 4.9107 0.6894 2.3487 1.2431 16.8997 38.0828 8.8569 0.9349 0.6067 81.0204 46.7475 10.3065 7.1044 7.5126 9.1511 2.7650 43.0709 1.0858 0.4026 1.9614 1.3873 2.0277 9.5041 13.1337 13.5130 9.1026 3.6021 9.7884 13.5152 11.7600 3.1976 102.1853 37.3177 77.6306 136.8112 21.4725 17.3906 42.1945 39.5207 42.9786 52.3058 24.9915 15.4144 7.3586 8.5377 8.3062 10.6766 52.4999 67.3264 33.8382 69.3190 99.6591 53.1403 54.3452 12.7778 6.9989 0.1273 3.8416
temp: 298.150 k
press: 1.00000 atm
elementType: 8 8 7 7 6 6 6 6 6 6 6 6 6 6 6 6 6 6 6 6 1 1 1 1 1 1 1 1 1 1 1 1 1 1 1 1 1 1 1 1 1 1 1 1 1 1
symmnumber: 1
zpe: 1035728.8 jmol-1
zpe.correction: 0.394488 hartree
zpe.thermalcorrener: 0.416977 hartree
zpe.thermalcorrenthalpy: 0.417921 hartree
zpe.thermalcorrgfe: 0.338173 hartree
zpe.sumelectzpe: -883.593114 hartree
zpe.sumelectthermal: -883.570625 hartree
zpe.sumelectthermalent: -883.569681 hartree
zpe.sumelectthermalfe: -883.649429 hartree
dipole: -6.7985 -0.4530 -0.0171
dipole: 6.8136
quadrupole: -171.1695 -118.3568 -122.8612
quadrupole: -0.6136 5.5191 1.6444
quadrupole: -33.7070 19.1057 14.6013 -0.6136 5.5191 1.6444
hfenergy: -883.9876023 hartree
pointgroup: C01 [X(C16H26N2O2)]
dipole: -2.6709614 0.2271628 0.0218538 debye
polarizability: 325.5250398|-10.5064333|193.8515312|6.0886731|22.4637623|146.8221165 unknown
InChI: InChI=1S/C16H26N2O2/c1-3-5-12-17(13-6-4-2)14-11-15-7-9-16(10-8-15)18(19)20/h7-10H,3-6,11-14H2,1-2H3
charge 0 multiplicity 1
46 atoms
O  6.244719 0.809281 0.903657
O  6.239341 -1.033381 -0.44163
N  -2.328817 0.0592 0.289183
N  5.644613 -0.042669 0.13832
C  -2.911783 1.38544 0.6194
C  -3.077296 -1.0883 0.865846
C  -0.869343 -0.021561 0.492209
C  -4.149939 1.728549 -0.236082
C  -3.007722 -2.358127 -0.00925
C  -0.076061 0.588578 -0.706345
C  -4.792847 3.079079 0.155636
C  -3.748178 -3.558798 0.623573
C  1.421235 0.448708 -0.51908
C  -6.025494 3.423756 -0.707685
C  -3.700083 -4.822802 -0.261802
C  2.138105 1.352407 0.313115
C  2.132216 -0.621803 -1.126476
C  3.519472 1.20175 0.535605
C  3.514197 -0.792843 -0.919621
C  4.190847 0.125203 -0.086107
H  -2.139395 2.15878 0.440842
H  -3.178036 1.455555 1.704994
H  -4.137902 -0.789458 0.963301
H  -2.72372 -1.329239 1.900712
H  -0.543118 0.481695 1.436248
H  -0.582232 -1.084593 0.588691
H  -4.907441 0.924578 -0.13971
H  -3.847668 1.744142 -1.301369
H  -1.949111 -2.638662 -0.186716
H  -3.439386 -2.123694 -1.001745
H  -0.352883 1.655069 -0.808852
H  -0.412986 0.072755 -1.622618
H  -5.086015 3.050305 1.225342
H  -4.038403 3.887378 0.062314
H  -3.304522 -3.783771 1.61519
H  -4.805322 -3.279945 0.81233
H  -6.807554 2.647532 -0.608536
H  -6.469875 4.391402 -0.410963
H  -5.753682 3.489743 -1.77789
H  -2.656062 -5.143308 -0.439056
H  -4.237053 -5.667138 0.20799
H  -4.164018 -4.633385 -1.24798
H  1.606129 2.188898 0.78108
H  1.592804 -1.323207 -1.773194
H  4.084107 1.891188 1.168824
H  4.074159 -1.608189 -1.385097
