program: Gaussian 09
title: 000220507
version: EM64L-G09RevD.01
frameworkgroup: C1[X(C20H28O2)]
method: RPBEPBE
basis: SDD
operation: Freq
keyword: #pfreq=noraman
keyword: PBEPBE/SDD
title: #p freq=noraman PBEPBE/SDD
converged: NO YES NO NO
title: Mulliken charges:
elementType: O O C C C C C C C C C C C C C C C C C C C C H H H H H H H H H H H H H H H H H H H H H H H H H H H H
charge: -0.461238 -0.235708 0.367339 -0.167373 -0.255348 0.211386 -0.548643 -0.481252 -0.562854 0.378351 0.083427 -0.452255 -0.812263 -0.433016 -0.644026 0.535398 -0.810864 -0.527186 -0.773372 -0.528303 -0.564280 0.180964 0.235089 0.234752 0.222784 0.222867 0.238308 0.196413 0.231843 0.229859 0.229747 0.221795 0.260842 0.224588 0.217610 0.216311 0.222320 0.232534 0.243954 0.211635 0.230922 0.212591 0.223279 0.331541 0.229721 0.227939 0.224051 0.239821 0.236272 0.251727
chargesum: 0.00000
title: Mulliken charges with hydrogens summed into heavy atoms:
elementType: O O C C C C C C C C C C C C C C C C C C C C
charge: -0.129697 -0.235708 0.367339 0.067716 -0.020597 0.211386 -0.102992 -0.046531 -0.101152 0.378351 0.083427 -0.000712 -0.109222 -0.216705 -0.189172 0.535398 -0.124353 -0.091316 -0.091660 -0.052210 -0.312553 0.180964
polarizability: 2.60501869e+02 -4.39755625e+00 2.00195984e+02 -1.18178729e+01 2.50632287e+00 1.79575388e+02
1716.lowfreq: -8.9418 -5.1519 -0.0006 -0.0005 -0.0003 17.0274 37.5389 51.0606 81.9196
frequency: 37.4187 50.9954 81.9156 107.2822 127.8024 141.2544 166.0874 184.5656 194.3947 217.9608 223.1906 235.1795 254.7769 268.4813 276.6796 282.3383 300.6561 309.3416 313.3569 333.7318 343.4967 364.3989 375.4048 377.4541 402.3766 408.8053 428.6718 455.4111 483.4867 496.4643 506.6597 536.5139 556.8851 565.2748 589.2033 599.1291 621.5066 652.5431 688.9497 715.5019 741.4745 769.4276 786.6571 803.3736 825.6762 844.9658 848.2579 875.2915 890.2588 902.7381 907.0764 920.6562 937.1470 943.5044 949.7892 968.6084 988.4779 991.0131 994.0955 1020.9551 1028.8257 1040.1810 1046.6158 1049.9183 1072.3293 1082.5528 1097.7899 1102.8181 1108.3339 1126.9937 1139.2108 1144.9995 1155.3154 1165.7633 1175.6936 1180.0550 1193.0405 1218.6780 1223.0061 1231.7371 1236.1252 1241.5003 1253.1074 1271.1077 1275.7409 1278.3815 1300.2140 1308.4316 1311.3158 1321.9970 1323.4043 1334.2609 1337.8927 1342.0763 1345.8239 1352.9456 1361.2097 1387.1498 1388.9001 1391.5312 1441.9607 1455.2269 1460.4399 1462.4650 1465.7480 1471.5336 1471.9525 1476.1324 1476.6934 1478.3632 1486.1877 1489.7461 1491.9308 1585.5847 1625.3631 1653.7265 2926.4223 2953.7250 2966.5398 2971.5017 2974.2204 2980.6257 2982.2020 2987.5220 2988.9882 2990.6383 2993.5528 3004.5540 3012.1468 3038.4834 3042.3040 3043.1304 3054.3689 3055.9448 3066.7813 3068.3793 3074.0974 3082.6361 3087.6442 3094.1370 3103.3399 3113.7731 3120.2254 3559.3776
redmass: 6.2148 3.7778 4.4863 2.3923 3.7648 2.7212 2.9701 2.9033 2.6195 1.3027 2.0061 1.1991 2.9997 1.3399 2.3288 1.2037 2.5544 2.5674 2.4308 2.2824 2.5032 3.2923 2.6093 2.5768 2.8233 3.1061 3.5589 3.4213 3.9966 3.8344 3.2481 2.8983 2.7681 3.8606 2.6680 4.1031 4.4826 3.7004 2.8217 2.9529 2.5066 2.9382 1.7120 2.0070 1.5102 2.1951 2.5020 1.8503 1.4262 1.9273 2.2019 1.8484 1.8205 1.7699 2.1130 1.9451 1.6941 2.7551 2.4689 2.0135 1.9039 1.8121 1.5927 1.9029 3.1687 2.2512 1.8835 2.3789 2.4837 1.7213 1.9687 1.9075 1.9650 1.9027 1.7252 1.7958 1.2869 1.6122 1.7064 1.6279 2.0593 1.4403 1.6389 1.4562 1.8498 1.3971 1.4786 1.4556 1.4715 1.5034 1.5152 1.5286 1.7472 2.1114 1.4508 1.5589 1.5275 1.2120 1.2049 1.2161 1.0826 1.0813 1.0738 1.0868 1.0693 1.0821 1.0632 1.0546 1.0694 1.0727 1.0782 1.0681 1.0640 9.9268 7.7050 7.4639 1.0790 1.0828 1.0591 1.0392 1.0600 1.0392 1.0639 1.0601 1.0612 1.0595 1.0365 1.0631 1.0988 1.1003 1.0991 1.1010 1.1028 1.0968 1.0966 1.1037 1.1001 1.0990 1.0992 1.0978 1.0985 1.0892 1.0912 1.0658
irintensity: 2.3577 1.4374 0.8234 0.4624 2.2175 0.0385 1.5761 0.3903 2.3367 0.1624 0.7701 2.0825 2.5509 40.5268 9.4495 58.5167 13.8661 1.9599 1.0169 1.4147 1.2912 1.7601 6.1308 1.3710 9.2689 1.6555 0.8713 0.2964 3.6021 1.1977 11.1007 1.2856 1.7102 0.9471 1.4525 0.5475 2.4897 1.5919 8.7222 0.2541 7.5815 3.6678 4.0876 2.5218 6.4780 5.3238 6.8958 3.5270 24.2101 3.4432 16.0230 15.4998 14.0337 5.8464 5.9308 3.5036 11.1212 0.3600 1.3606 11.3315 2.3818 2.3775 92.7138 0.7098 6.6795 2.2477 4.6352 15.8382 4.8221 3.3311 1.9586 26.0717 2.6136 6.1264 17.7865 2.0125 14.9158 4.0544 26.5890 8.6877 5.3740 10.7986 12.7151 8.4214 25.0162 2.4044 1.0470 5.9408 5.4531 8.0838 2.5728 2.6157 4.6776 6.2010 1.9933 5.7503 1.5959 14.6930 50.1259 3.9241 13.1680 11.1810 5.7341 6.0774 3.8716 15.8200 4.0716 20.9435 6.9737 22.1663 4.9718 6.5930 6.8245 182.9617 177.0358 12.2904 5.8748 20.2967 24.7997 28.6953 38.7080 16.3289 5.2479 40.7657 14.3063 53.3367 24.5532 46.3139 17.7051 38.3858 22.4913 15.3499 31.7083 46.6143 23.5119 48.8499 30.5933 33.5426 24.3604 31.4573 12.9415 27.2903 10.6533 2.5805
temp: 298.150 k
press: 1.00000 atm
elementType: 8 8 6 6 6 6 6 6 6 6 6 6 6 6 6 6 6 6 6 6 6 6 1 1 1 1 1 1 1 1 1 1 1 1 1 1 1 1 1 1 1 1 1 1 1 1 1 1 1 1
symmnumber: 1
zpe: 1139217.4 jmol-1
zpe.correction: 0.433905 hartree
zpe.thermalcorrener: 0.454550 hartree
zpe.thermalcorrenthalpy: 0.455494 hartree
zpe.thermalcorrgfe: 0.387305 hartree
zpe.sumelectzpe: -927.670227 hartree
zpe.sumelectthermal: -927.649582 hartree
zpe.sumelectthermalent: -927.648638 hartree
zpe.sumelectthermalfe: -927.716827 hartree
dipole: -4.9326 2.0556 1.1013
dipole: 5.4561
quadrupole: -156.2598 -128.7662 -137.0999
quadrupole: 5.2486 22.8515 -2.0718
quadrupole: -15.5511 11.9424 3.6087 5.2486 22.8515 -2.0718
hfenergy: -928.1041322 hartree
pointgroup: C01 [X(C20H28O2)]
dipole: -1.9465116 0.7667989 0.4806316 debye
polarizability: 260.7005651|-3.3172727|199.6581188|-11.5252897|4.029275|179.9145564 unknown
InChI: InChI=1S/C20H28O2/c1-18-9-6-14(21)12-13(18)4-5-15-16(18)7-10-19(2)17(15)8-11-20(19,3)22/h7,12,15,17,22H,4-6,8-11H2,1-3H3
charge 0 multiplicity 1
50 atoms
O  -4.788252 -1.221394 0.27412
O  5.06723 -0.85142 -1.81697
C  -2.421882 -0.500229 0.233147
C  -1.691599 0.731079 -0.382421
C  -0.358571 1.053304 0.324342
C  -3.8037 -0.441579 -0.514185
C  -2.769415 1.850875 -0.421542
C  -4.136611 1.092999 -0.512652
C  -1.538231 -1.744898 -0.00935
C  0.468095 -0.233079 0.526122
C  1.932703 -0.025643 1.010042
C  0.421001 2.141865 -0.468613
C  -2.65361 -0.335925 1.760824
C  -0.084168 -1.468306 0.353491
C  1.868012 2.369334 0.059361
C  2.562334 1.026239 0.079403
C  -3.786066 -1.006749 -1.951476
C  2.811783 -1.30901 1.035052
C  1.893922 0.511199 2.482439
C  3.319312 -1.755583 -0.350909
C  3.583017 0.737079 -0.790713
C  4.093856 -0.628185 -1.032973
H  -1.431388 0.463963 -1.429586
H  -0.591732 1.478943 1.325932
H  -2.617842 2.537426 -1.273316
H  -2.721988 2.463617 0.499374
H  -4.76725 1.310811 0.368128
H  -4.710385 1.382269 -1.412919
H  -1.586126 -2.066074 -1.070087
H  -1.908579 -2.603739 0.585512
H  -0.141342 3.094558 -0.435723
H  0.484105 1.832302 -1.531309
H  -3.310126 -1.142818 2.123884
H  -1.693973 -0.389628 2.304355
H  -3.140794 0.623471 2.009816
H  0.536958 -2.360807 0.501909
H  1.823209 2.819218 1.069697
H  2.40185 3.078676 -0.598302
H  -3.593664 -2.093621 -1.947736
H  -4.768194 -0.836728 -2.435287
H  -3.023808 -0.516396 -2.583505
H  2.267429 -2.13028 1.536233
H  3.693077 -1.092474 1.67115
H  -5.64455 -1.23627 -0.223819
H  1.55211 -0.299084 3.151873
H  2.903715 0.825862 2.805465
H  1.210851 1.366134 2.616065
H  2.466926 -2.022927 -1.008188
H  3.971011 -2.644144 -0.281345
H  4.019743 1.527068 -1.415708
