program: Gaussian 09
title: 000220513
version: EM64L-G09RevD.01
frameworkgroup: C1[X(C24H14O2)]
method: RPBEPBE
basis: SDD
operation: Freq
keyword: #pfreq=noraman
keyword: PBEPBE/SDD
title: #p freq=noraman PBEPBE/SDD
converged: YES YES YES YES
title: Mulliken charges:
elementType: O O C C C C C C C C C C C C C C C C C C C C C C C C H H H H H H H H H H H H H H
charge: -0.176698 -0.176699 -0.774088 -0.774087 0.336294 0.336295 0.407917 0.407925 0.407921 0.407921 -0.269586 -0.269586 -0.452786 -0.452787 -0.452784 -0.452788 0.278354 0.278355 -0.235895 -0.235894 -0.235894 -0.235896 -0.376147 -0.376146 -0.229329 -0.229329 0.291527 0.291527 0.247195 0.247193 0.247194 0.247194 0.227573 0.227573 0.227573 0.227573 0.290590 0.290590 0.241069 0.241069
chargesum: 0.00000
title: Mulliken charges with hydrogens summed into heavy atoms:
elementType: O O C C C C C C C C C C C C C C C C C C C C C C C C
charge: -0.176698 -0.176699 -0.482561 -0.482560 0.336294 0.336295 0.407917 0.407925 0.407921 0.407921 -0.269586 -0.269586 -0.205591 -0.205594 -0.205590 -0.205595 0.278354 0.278355 -0.008323 -0.008322 -0.008321 -0.008323 -0.085556 -0.085556 0.011740 0.011740
polarizability: 2.99898497e+02 -2.91846328e-03 2.18215801e+02 -5.03302355e-05 3.14480801e-03 2.59830498e+02
1716.lowfreq: -11.4071 -10.4013 -0.0008 -0.0004 0.0005 4.7763 34.0145 56.6646 61.4755
frequency: 34.0142 56.6519 61.4755 75.4423 126.6930 127.5369 137.8778 157.6948 172.6590 226.4609 252.7578 265.8013 298.3606 346.4728 362.0454 368.2864 371.9830 420.4456 421.0647 431.3676 448.1048 460.6101 477.4431 493.1320 527.8506 539.5670 590.7172 611.7473 612.3151 617.3380 640.8948 658.0267 685.1910 703.3987 713.9481 718.4111 753.7000 754.0811 770.3253 778.5623 783.1637 794.8523 812.5627 828.1394 836.2162 864.7304 884.6452 889.7346 900.7113 914.0081 931.9560 943.4848 948.1268 985.2467 985.5909 995.8506 1013.2158 1022.3080 1022.3744 1022.3873 1030.7061 1076.1045 1079.3092 1109.0355 1141.6522 1144.4650 1147.2491 1162.8655 1168.2660 1171.8708 1173.7164 1183.4729 1203.0467 1203.4481 1218.4369 1219.4248 1220.5568 1268.9997 1293.0560 1305.4170 1315.6438 1353.4137 1391.3888 1394.5585 1396.6333 1438.4487 1444.1544 1445.5918 1456.1384 1467.2469 1469.5871 1526.2244 1540.2082 1576.7707 1596.1176 1596.2238 1604.5363 1606.7859 1614.6796 1620.0552 3092.8855 3096.7492 3126.0914 3126.2546 3133.5921 3133.8288 3137.2578 3145.7735 3146.0804 3150.9411 3160.7305 3164.0551 3164.3876 3171.4652
redmass: 5.8958 7.3030 5.1951 9.7466 5.0072 4.7135 3.8282 4.5998 6.7800 5.8555 5.5817 7.2946 6.5347 4.2366 10.6651 4.3077 4.3295 6.5316 3.2257 6.5149 5.1221 4.4540 8.1729 5.4048 4.3704 4.7089 5.0137 5.1917 5.7949 5.0085 6.3308 6.5140 4.7728 5.0716 6.9021 3.1761 4.9438 1.3950 1.5123 1.8100 4.8349 3.7850 2.3025 4.0108 4.2753 1.9201 1.7563 2.0745 4.4993 4.3879 1.7552 1.4011 1.4358 1.3205 1.3211 1.3967 1.3620 2.2792 7.0023 2.3844 2.1667 3.0205 2.6576 2.5027 2.4787 1.9701 2.0961 2.0092 1.2765 1.0777 1.0918 1.9079 1.2081 2.8021 1.6565 1.5034 1.6559 1.6119 1.5148 6.4214 1.3289 3.6885 7.1969 9.6034 7.3894 2.4684 2.3901 2.3655 2.2064 2.7323 2.7159 10.6310 10.6174 7.2308 6.2538 6.8075 6.9964 6.6775 7.2627 9.4288 1.0878 1.0890 1.0854 1.0854 1.0898 1.0899 1.0862 1.0947 1.0948 1.0900 1.0947 1.1005 1.1004 1.1006
irintensity: 1.7716 0.0000 0.8487 4.6587 0.0000 0.4752 0.0000 0.3657 2.0521 1.4332 0.0894 0.2287 0.0001 2.9317 19.5727 0.0000 0.0066 0.0000 3.0528 0.1623 0.0331 0.0425 7.7810 0.0000 0.0000 0.2998 88.5356 0.0000 2.2909 0.2492 1.3311 1.7606 21.8560 0.0000 1.8992 66.6556 0.0000 50.8366 41.9509 7.4083 0.4736 8.4501 21.5975 0.0217 0.0000 0.0000 0.1552 0.0000 54.7156 0.0297 0.0000 0.3782 4.0748 0.0000 0.0001 3.5691 0.0000 7.4636 3.2636 3.5620 0.7510 0.0000 1.3171 0.3953 6.4973 28.9887 0.0000 0.7761 1.3144 1.0689 3.7929 4.4145 0.0000 0.8402 129.1076 24.6832 3.5475 4.9185 1.5973 309.9431 0.0000 18.7594 0.0687 0.5064 1.1090 0.4114 10.0936 0.0000 39.2775 1.9681 40.0425 0.9808 259.5612 39.3684 2.0439 22.9942 0.0000 0.6693 0.1581 89.0899 4.2300 2.3354 0.0001 0.9048 4.1678 1.2113 3.4539 0.0027 45.8108 4.2477 1.9165 50.5300 20.9734 30.5746
temp: 298.150 k
press: 1.00000 atm
elementType: 8 8 6 6 6 6 6 6 6 6 6 6 6 6 6 6 6 6 6 6 6 6 6 6 6 6 1 1 1 1 1 1 1 1 1 1 1 1 1 1
symmnumber: 1
zpe: 795369.3 jmol-1
zpe.correction: 0.302940 hartree
zpe.thermalcorrener: 0.321090 hartree
zpe.thermalcorrenthalpy: 0.322034 hartree
zpe.thermalcorrgfe: 0.256889 hartree
zpe.sumelectzpe: -1071.701122 hartree
zpe.sumelectthermal: -1071.682972 hartree
zpe.sumelectthermalent: -1071.682028 hartree
zpe.sumelectthermalfe: -1071.747173 hartree
dipole: -0.4784 0.0005 0.0000
dipole: 0.4784
quadrupole: -125.3762 -141.2916 -150.3684
quadrupole: -0.0014 0.0000 -0.0016
quadrupole: 13.6359 -2.2795 -11.3564 -0.0014 0.0000 -0.0016
hfenergy: -1072.0040621 hartree
pointgroup: C01 [X(C24H14O2)]
dipole: -0.1882265 0.0002556 0.0000011 debye
polarizability: 299.8984822|-0.0343653|218.2158173|-0.0005698|-0.009786|259.8304962 unknown
InChI: InChI=1S/C24H14O2/c25-23-17-11-5-6-12-18(17)24(26)22-20-14-8-2-1-7-13(14)19(21(22)23)15-9-3-4-10-16(15)20/h1-12,19-20H
charge 0 multiplicity 1
40 atoms
O  -1.529048 0.000647 -2.758828
O  -1.528978 -0.00064 2.758856
C  1.085565 -0.000426 -1.311915
C  1.085598 -0.001163 1.311876
C  -0.310654 -0.000076 -0.688432
C  -0.310637 -0.000468 0.688428
C  1.800122 -1.227734 -0.71047
C  1.800996 1.226032 -0.709784
C  1.800141 -1.228132 0.709726
C  1.801013 1.225634 0.710413
C  -1.556461 0.000577 -1.484897
C  -1.556423 -0.000334 1.484925
C  2.415567 -2.268587 -1.425631
C  2.417194 2.266841 -1.424361
C  2.415605 -2.269385 1.424288
C  2.417228 2.266044 1.425557
C  -2.84377 0.000867 -0.713975
C  -2.843752 0.000471 0.714037
C  3.039624 -3.321692 -0.707671
C  3.042012 3.319093 -0.705813
C  3.039643 -3.322088 0.705723
C  3.042028 3.318698 0.707582
C  -4.072387 0.001562 -1.41498
C  -4.072351 0.000793 1.415073
C  -5.294011 0.0019 -0.708213
C  -5.293993 0.001515 0.708337
H  1.048014 -0.000117 -2.411297
H  1.048076 -0.001466 2.411258
H  2.412264 -2.269036 -2.521346
H  2.4139 2.2679 -2.520077
H  2.412331 -2.270446 2.520003
H  2.41396 2.266491 2.521273
H  3.521967 -4.140394 -1.253038
H  3.524953 4.137747 -1.250722
H  3.522001 -4.141093 1.25062
H  3.524981 4.137048 1.252936
H  -4.044922 0.001826 -2.509297
H  -4.044859 0.000448 2.50939
H  -6.242634 0.002464 -1.255374
H  -6.242603 0.001776 1.255522
