program: Gaussian 09
title: 000220491
version: EM64L-G09RevD.01
frameworkgroup: C1[X(C11H14N4O5)]
method: RPBEPBE
basis: SDD
operation: Freq
keyword: #p
keyword: freq=noraman
keyword: PBEPBE/SDD
title: #p freq=noraman PBEPBE/SDD
converged: YES YES NO NO
title: Mulliken charges:
elementType: O O O O O N N N N C C C C C C C C C C C H H H H H H H H H H H H H H
charge: -0.434164 -0.184553 -0.264603 -0.210395 -0.204502 -0.423792 0.025797 0.026180 0.016494 -0.378701 -0.383713 -0.432970 -0.315310 -0.214580 0.312521 0.264648 -0.296165 -0.496959 0.446531 -0.368184 0.214211 0.201284 0.230374 0.189552 0.229336 0.225618 0.182231 0.215430 0.221313 0.298166 0.336237 0.347389 0.293143 0.332133
chargesum: 0.00000
title: Mulliken charges with hydrogens summed into heavy atoms:
elementType: O O O O O N N N N C C C C C C C C C C C
charge: -0.102031 -0.184553 -0.264603 -0.210395 -0.204502 -0.076402 0.025797 0.026180 0.016494 0.036794 0.036212 0.021985 0.082351 0.006733 0.312521 0.264648 0.002002 -0.160722 0.446531 -0.075041
polarizability: 3.27961510e+02 -2.37675888e+01 1.96906112e+02 4.73213344e+01 1.42739363e+01 1.11319103e+02
1716.lowfreq: -11.5446 -5.5193 -2.9759 -0.0006 -0.0005 0.0002 7.6019 23.0907 49.4497
frequency: 2.7687 23.0629 49.4438 54.7979 61.4610 72.4425 73.1182 107.8609 133.7004 157.7012 161.5037 165.4542 172.7491 228.7858 240.9715 289.2491 314.8431 315.9908 321.0767 342.0355 373.2766 414.3917 417.4752 442.7384 492.2439 501.2261 516.1721 523.5798 616.5845 652.8860 654.0928 675.2783 706.8283 726.9297 752.5999 754.9467 809.9259 816.8838 829.8026 858.3304 864.4377 887.8202 933.6911 941.1436 963.6583 993.8680 1003.0443 1011.0674 1041.0444 1055.8403 1058.4067 1079.2533 1098.7944 1101.4486 1137.9096 1166.6396 1171.5892 1195.8920 1213.5286 1229.7242 1248.3942 1279.5409 1286.7893 1297.0251 1309.9694 1324.2172 1331.4392 1346.1363 1358.8196 1365.2654 1382.9318 1399.9853 1446.2958 1447.0116 1463.8509 1469.7015 1476.4389 1484.0291 1518.7204 1578.2363 1601.3895 1625.1298 2947.5097 2963.3849 2967.7209 2977.2766 2984.0506 3018.5324 3041.1023 3060.7188 3071.8615 3180.2607 3188.5826 3201.0769 3220.9028 3561.7892
redmass: 7.0685 7.1442 5.8164 2.3940 11.1043 9.0931 3.1391 3.3768 5.1809 4.4657 5.3628 5.0463 2.9758 3.6236 4.6910 7.0235 4.9168 1.1350 5.2977 5.4295 11.7793 5.2966 3.7243 4.1782 4.6095 4.0820 3.6835 5.2451 6.1979 7.7550 5.8484 10.7031 7.5809 4.9964 1.2972 5.3296 1.4052 2.5122 1.3922 1.6770 1.4212 6.4649 1.6020 3.3244 1.4083 1.9845 3.5074 1.3179 2.7964 2.5689 2.5260 2.1705 1.5642 3.6391 1.3677 5.4412 2.1383 1.2588 4.6901 1.8873 1.3908 1.2257 1.1031 1.7786 1.3710 1.6668 1.4642 3.7440 1.7093 4.3610 1.2619 3.2282 1.4653 2.4257 1.0725 1.0969 2.8143 1.0974 3.7712 5.3238 6.3787 7.1632 1.0690 1.0624 1.0645 1.0640 1.0854 1.0970 1.0981 1.0963 1.0986 1.0895 1.0920 1.0961 1.0795 1.0662
irintensity: 0.7361 0.5678 1.0054 2.9611 0.8547 0.3481 2.5192 3.3983 3.1975 2.9459 6.2893 2.2356 1.7444 6.9267 9.2352 1.4928 2.4073 190.9434 1.4905 3.5271 0.7215 2.5960 28.5544 1.3856 1.0912 13.2239 11.7096 2.8837 3.6927 16.0816 2.8207 11.4404 7.6152 1.4795 17.3736 5.2864 35.0186 12.8235 61.4277 3.4860 23.5730 5.2653 39.9610 35.8401 24.7563 22.2428 17.9061 0.1454 29.3119 12.3321 102.8669 15.0933 32.6723 54.6601 53.2789 286.2643 107.4470 15.3080 330.6580 164.1665 14.2867 9.0057 0.6255 75.2486 11.0236 41.0029 52.7478 168.3039 19.7107 41.6282 22.2264 22.1767 12.6939 5.9657 0.1823 4.5669 52.8901 7.6128 118.7041 94.2036 26.8853 433.2311 62.4986 6.8819 22.9728 72.5906 29.1173 1.8712 47.8317 17.3684 69.4713 2.9040 19.9619 0.0722 70.0471 6.6496
temp: 298.150 k
press: 1.00000 atm
elementType: 8 8 8 8 8 7 7 7 7 6 6 6 6 6 6 6 6 6 6 6 1 1 1 1 1 1 1 1 1 1 1 1 1 1
symmnumber: 1
zpe: 666320.6 jmol-1
zpe.correction: 0.253788 hartree
zpe.thermalcorrener: 0.273480 hartree
zpe.thermalcorrenthalpy: 0.274424 hartree
zpe.thermalcorrgfe: 0.200763 hartree
zpe.sumelectzpe: -1020.997488 hartree
zpe.sumelectthermal: -1020.977796 hartree
zpe.sumelectthermalent: -1020.976852 hartree
zpe.sumelectthermalfe: -1021.050513 hartree
dipole: -8.0540 -1.8643 -4.1725
dipole: 9.2602
quadrupole: -144.2545 -127.1996 -121.8500
quadrupole: 9.2178 10.6486 -4.5280
quadrupole: -13.1531 3.9018 9.2514 9.2178 10.6486 -4.5280
hfenergy: -1021.2512756 hartree
pointgroup: C01 [X(C11H14N4O5)]
dipole: -3.2044568 -0.6095306 -1.6227096 debye
polarizability: 331.6966673|-25.1550071|190.9855356|37.1488958|25.8026745|113.5045216 unknown
InChI: InChI=1S/C11H14N4O5/c16-7-3-1-2-6-12-13-10-5-4-9(14(17)18)8-11(10)15(19)20/h4-6,8,13,16H,1-3,7H2
charge 0 multiplicity 1
34 atoms
O  -6.074843 -1.394589 2.643079
O  2.656561 3.069635 1.102887
O  0.463124 2.988862 0.497387
O  4.851816 -2.621343 -0.371992
O  5.617906 -0.661904 0.52177
N  -0.531742 0.809533 -0.533758
N  -1.551526 0.025384 -1.075649
N  1.65098 2.435077 0.612584
N  4.68273 -1.399463 0.020443
C  -5.155282 -0.105897 -0.89239
C  -4.97113 -0.815755 0.468187
C  -3.887491 -0.153895 -1.789596
C  -6.257585 -0.791261 1.314455
C  -2.725574 0.598318 -1.198414
C  0.732234 0.28305 -0.391967
C  1.822074 1.052896 0.164195
C  1.012237 -1.063476 -0.80025
C  3.113815 0.498139 0.298167
C  3.334743 -0.819225 -0.116656
C  2.285747 -1.608534 -0.667932
H  -5.990485 -0.575611 -1.448843
H  -5.448891 0.950622 -0.723034
H  -4.159121 -0.336515 1.048446
H  -4.659321 -1.867461 0.29418
H  -3.580851 -1.19866 -1.977405
H  -4.135118 0.299106 -2.772601
H  -7.088865 -1.284795 0.763897
H  -6.558878 0.248246 1.530492
H  -2.909336 1.646572 -0.88482
H  0.186652 -1.640901 -1.219561
H  3.924021 1.097666 0.720866
H  -0.653244 1.795054 -0.218892
H  2.502453 -2.633763 -0.979085
H  -5.821011 -2.345913 2.533813
