program: Gaussian 09
title: 000220488
version: EM64L-G09RevD.01
frameworkgroup: C1[X(C11H22N2O3)]
method: RPBEPBE
basis: SDD
operation: Freq
keyword: #p
keyword: freq=noraman
keyword: PBEPBE/SDD
title: #p freq=noraman PBEPBE/SDD
converged: YES YES NO NO
title: Mulliken charges:
elementType: O O O N N C C C C C C C C C C C H H H H H H H H H H H H H H H H H H H H H H
charge: -0.246763 -0.318773 -0.296885 -0.088170 -0.373989 -0.325851 -0.338417 -0.347495 -0.381404 -0.324134 -0.317834 -0.407567 0.296220 0.043638 -0.686081 -0.681733 0.181368 0.196258 0.188885 0.211960 0.209464 0.188850 0.218834 0.231404 0.193124 0.214801 0.213003 0.192859 0.208213 0.256438 0.319707 0.233872 0.220229 0.231321 0.207208 0.215207 0.252137 0.210095
chargesum: 0.00000
title: Mulliken charges with hydrogens summed into heavy atoms:
elementType: O O O N N C C C C C C C C C C C
charge: -0.246763 -0.318773 -0.296885 -0.088170 -0.054282 0.051775 0.062428 0.050819 0.068834 0.083791 0.088027 0.057084 0.296220 0.277510 -0.027322 -0.004294
polarizability: 1.68838691e+02 1.02848351e+01 1.33883842e+02 -2.87495036e+00 -3.99248459e+00 1.26665507e+02
1716.lowfreq: -12.3711 -7.1751 -4.1281 0.0003 0.0005 0.0008 6.8917 21.3125 31.7439
frequency: -3.6886 20.9813 31.6320 56.7272 61.1387 83.7241 102.6516 134.4919 149.1585 192.0258 197.0290 217.8715 237.3864 240.9417 280.0593 310.3862 321.6711 361.2150 377.9724 401.2329 403.3805 441.9362 467.0382 486.0088 515.1861 537.4861 604.4168 661.8059 700.3579 755.9933 779.1884 787.8486 807.4676 841.1837 858.4454 892.5218 905.6913 917.8154 924.9211 941.4972 981.6129 1008.1820 1027.4664 1052.7184 1071.8228 1085.8403 1098.6908 1105.7694 1107.8873 1116.6349 1135.4543 1155.1403 1157.2927 1179.4618 1190.6029 1199.9529 1212.5210 1248.7006 1266.7625 1268.9070 1291.5345 1300.2246 1320.2949 1327.5391 1332.6823 1339.0907 1346.2187 1360.4616 1366.4402 1370.9476 1378.4938 1393.5720 1394.5315 1443.3110 1446.3766 1451.0788 1451.7225 1456.2703 1458.5203 1461.2820 1464.7982 1472.1520 1480.4328 1484.0978 1488.5592 1657.4974 2833.7230 2854.7910 2866.4070 2954.1151 2958.0472 2986.6972 2991.6328 2994.1110 2998.7803 2999.7083 3023.3315 3025.2396 3046.1757 3063.5286 3074.7315 3079.0749 3081.8035 3082.6015 3092.1017 3097.0263 3102.0833 3578.1369
redmass: 4.4067 3.1665 3.3456 4.0842 4.5500 4.0227 4.3090 2.4292 3.5061 1.0224 2.5391 3.6323 1.7625 1.1988 3.3738 2.4178 2.3538 2.7084 3.9680 2.0185 3.3264 2.8201 2.8072 3.3412 2.2214 1.3054 1.8442 4.5709 10.2356 2.6128 1.7567 2.8406 3.6499 1.5924 2.3263 2.7681 2.5142 2.2950 1.2318 1.3602 2.8683 2.5443 2.1610 2.1534 2.6239 2.3510 3.0031 1.8104 2.9896 3.2884 2.6443 2.2885 2.1621 2.0214 1.0651 1.9345 1.3025 1.3269 1.3361 1.3146 1.2132 1.2386 1.3780 1.2543 1.2731 1.3187 1.2922 1.3239 1.3467 1.2668 1.2659 1.4591 1.2323 1.0815 1.0803 1.1027 1.1152 1.0540 1.0968 1.0832 1.0481 1.0529 1.1296 1.4681 1.1668 8.8686 1.0699 1.0707 1.0688 1.0664 1.0665 1.0355 1.0357 1.0855 1.0608 1.0640 1.0892 1.0864 1.0892 1.0999 1.1026 1.0963 1.0992 1.0978 1.0987 1.1006 1.1005 1.0775
irintensity: 0.7782 0.8472 0.9587 1.0544 8.3839 0.6488 0.7146 0.1865 1.7344 0.0306 9.8782 4.3209 1.9288 0.5527 7.1785 18.7316 1.9285 2.2012 10.0126 1.3183 1.0525 1.1969 1.4223 2.1986 24.4978 125.5676 17.0996 5.4580 18.9304 7.2597 4.2302 7.3027 25.7390 0.4338 17.0908 6.8803 19.5635 5.0959 2.4876 0.1766 109.7187 46.5757 7.1115 21.5267 8.0588 7.5271 65.7257 88.3552 65.8039 93.3300 36.2442 1.0602 17.4025 95.3867 2.0659 151.1407 17.4721 15.8413 65.9057 2.7892 2.2991 20.2903 7.7643 4.3707 6.3659 4.8077 15.4137 4.9307 2.5602 2.5342 33.0317 4.0106 22.4883 2.7228 3.2208 42.3746 21.9243 7.6545 3.5657 3.4059 5.3004 6.8456 39.7817 167.6195 118.9992 254.9908 65.6258 49.2881 151.0486 30.1721 109.4342 16.9974 25.6594 30.0576 31.7335 17.8647 49.9509 7.0693 36.1117 41.9451 20.3532 43.6891 8.8993 32.2397 57.2394 20.1011 34.5310 28.3261
temp: 298.150 k
press: 1.00000 atm
elementType: 8 8 8 7 7 6 6 6 6 6 6 6 6 6 6 6 1 1 1 1 1 1 1 1 1 1 1 1 1 1 1 1 1 1 1 1 1 1
symmnumber: 1
zpe: 862518.8 jmol-1
zpe.correction: 0.328516 hartree
zpe.thermalcorrener: 0.345716 hartree
zpe.thermalcorrenthalpy: 0.346661 hartree
zpe.thermalcorrgfe: 0.281920 hartree
zpe.sumelectzpe: -766.225425 hartree
zpe.sumelectthermal: -766.208225 hartree
zpe.sumelectthermalent: -766.207281 hartree
zpe.sumelectthermalfe: -766.272021 hartree
dipole: -0.7659 1.0436 -2.2320
dipole: 2.5802
quadrupole: -103.7853 -96.0881 -99.4081
quadrupole: 13.7597 3.8561 -5.8815
quadrupole: -4.0248 3.6724 0.3524 13.7597 3.8561 -5.8815
hfenergy: -766.5539415 hartree
pointgroup: C01 [X(C11H22N2O3)]
dipole: -0.3204319 0.1847023 -0.9453697 debye
polarizability: 167.0746519|12.2109921|133.5734474|-4.7580902|-5.5781101|128.7399415 unknown
InChI: InChI=1S/C11H22N2O3/c1-10(2)16-11(14)12-4-3-5-13-6-8-15-9-7-13/h10,12H,3-9H2,1-2H3
charge 0 multiplicity 1
38 atoms
O  5.044086 -1.235155 0.203293
O  -3.27437 -0.454785 -0.638449
O  -2.779799 0.780312 1.320183
N  2.79476 0.578961 -0.170164
N  -1.653642 1.138242 -0.710165
C  1.484012 1.028534 -0.702251
C  2.687944 -0.619372 0.704672
C  3.776294 0.321734 -1.257272
C  0.574979 1.651659 0.375408
C  4.068528 -0.98068 1.276109
C  5.14387 -0.045691 -0.658727
C  -0.758262 2.188483 -0.197509
C  -2.57532 0.517447 0.104337
C  -4.303787 -1.245086 0.119624
C  -5.300748 -1.724822 -0.938163
C  -3.60784 -2.383356 0.880207
H  0.942101 0.188677 -1.212422
H  1.690164 1.796632 -1.475215
H  2.282614 -1.497162 0.138612
H  1.999249 -0.407479 1.541906
H  3.878684 1.237188 -1.871199
H  3.43974 -0.509112 -1.929251
H  1.12054 2.486601 0.855537
H  0.333832 0.921031 1.16899
H  4.429944 -0.15122 1.921652
H  4.023834 -1.914241 1.861064
H  5.865967 -0.312259 -1.44834
H  5.533073 0.81252 -0.069223
H  -0.561939 2.90647 -1.017138
H  -1.302992 2.723611 0.59952
H  -1.583388 0.815271 -1.674907
H  -4.780883 -0.551456 0.83696
H  -4.799813 -2.370754 -1.680963
H  -5.753124 -0.869104 -1.467918
H  -6.108027 -2.30733 -0.45831
H  -3.069521 -3.045837 0.178761
H  -2.892966 -1.977245 1.615546
H  -4.355795 -2.988028 1.425804
