program: Gaussian 09
title: 000220476
version: EM64L-G09RevD.01
frameworkgroup: C1[X(C15H12N2O3)]
method: RPBEPBE
basis: SDD
operation: Freq
keyword: #p
keyword: freq=noraman
keyword: PBEPBE/SDD
title: #p freq=noraman PBEPBE/SDD
converged: YES YES NO NO
title: Mulliken charges:
elementType: O O O N N C C C C C C C C C C C C C C C H H H H H H H H H H H H
charge: -0.261773 -0.258662 -0.224109 0.057429 -0.415372 0.220834 0.173835 0.505464 -0.484356 -0.330517 -0.202182 -0.391595 -0.391888 0.259162 0.172673 -0.350026 -0.360238 -0.217467 -0.232149 -0.225592 0.305143 0.253062 0.227302 0.240371 0.240544 0.206755 0.273988 0.223160 0.287306 0.234192 0.230776 0.233932
chargesum: 0.00000
title: Mulliken charges with hydrogens summed into heavy atoms:
elementType: O O O N N C C C C C C C C C C C C C C C
charge: -0.261773 -0.258662 -0.224109 0.057429 -0.128067 0.220834 0.173835 0.505464 -0.179213 -0.077455 0.278732 -0.164293 -0.185132 0.259162 0.172673 -0.076038 -0.137078 0.016725 -0.001373 0.008340
polarizability: 4.13357818e+02 4.69283297e+00 1.84970681e+02 3.36276571e+00 4.96509546e+00 8.27519800e+01
1716.lowfreq: -23.7452 -0.0004 0.0005 0.0008 2.5733 3.6697 8.2633 23.2337 34.1984
frequency: -23.3674 23.2258 34.1577 38.7121 61.4322 99.5656 113.7330 173.9821 207.8078 215.1757 216.3674 236.1687 291.4080 351.9967 369.2222 381.7425 403.4055 413.8126 438.6022 478.9056 491.8472 573.6685 606.8626 613.7618 616.8203 629.8470 670.9992 680.6186 683.4824 703.6986 723.3693 763.7265 786.9219 793.2527 808.3427 840.8913 856.7254 871.8074 906.6285 923.8411 934.4090 940.3841 943.4958 979.6370 983.7140 989.3425 1005.3372 1017.0212 1035.2212 1061.9805 1065.9994 1084.9857 1116.5304 1119.7986 1141.8605 1174.3268 1190.2505 1195.7140 1238.3624 1255.6826 1263.3718 1316.5601 1337.2040 1365.6226 1384.1575 1394.8616 1433.7919 1456.9706 1472.0073 1479.3161 1487.3384 1510.6397 1572.0658 1582.4041 1607.2083 1610.4185 1621.4728 1624.9764 2961.6978 3016.4683 3095.2817 3118.8173 3133.3452 3136.2609 3146.0121 3158.9349 3170.7268 3183.3164 3186.7971 3384.9239
redmass: 2.3892 5.9444 4.8658 5.9442 6.5469 6.4515 6.4335 6.2333 3.9924 6.1756 5.7027 6.0420 5.0771 7.9432 4.8978 6.7316 2.8464 4.4969 3.3518 5.4871 4.8533 6.0350 2.5853 6.0857 6.4563 1.5614 6.5480 8.8760 5.6278 1.5559 4.3859 6.9181 3.5702 2.9955 1.3544 10.4343 1.2514 7.3161 1.3523 1.3988 1.5030 3.3625 1.5280 4.5744 1.4869 4.6899 1.3433 3.9759 2.6168 3.9862 1.4555 1.6382 2.4600 1.0370 1.7103 1.0584 1.1438 1.7508 3.1135 1.7590 2.0938 1.3396 1.7852 1.2853 8.9652 3.7143 2.2280 4.2987 2.2161 2.4237 1.2426 2.0488 6.5447 6.1195 7.4422 6.1325 8.0799 7.6082 1.0867 1.0534 1.1190 1.0870 1.0871 1.0898 1.0920 1.0957 1.1007 1.0951 1.0942 1.0750
irintensity: 15.4820 1.5660 0.5713 1.0267 4.3736 1.8105 2.9542 2.6447 9.3024 1.7077 1.3463 10.8757 10.3596 1.0325 2.6007 6.1273 0.4234 14.5581 3.7058 2.9408 7.5232 1.4056 2.9196 3.7367 5.6928 78.3205 33.7012 3.9509 8.4812 82.1474 4.8491 13.0040 21.5414 12.3389 36.3010 24.5976 1.2168 38.1633 0.9842 33.5951 2.1045 0.1321 30.7295 184.3247 1.5034 2.6186 2.7939 0.5355 20.6210 6.9058 4.3287 65.4922 187.2209 0.0719 30.1869 2.7409 40.2601 41.8730 365.9212 174.3536 158.1917 2.3426 21.3931 0.4040 1.2735 47.2677 4.1265 105.8265 237.2343 17.4446 26.1950 225.8878 50.3790 23.8624 0.5936 4.3627 158.7336 20.3641 61.0787 145.2237 30.7137 14.8902 1.6208 10.0854 22.5330 16.9052 26.2711 4.5956 6.7374 11.2956
temp: 298.150 k
press: 1.00000 atm
elementType: 8 8 8 7 7 6 6 6 6 6 6 6 6 6 6 6 6 6 6 6 1 1 1 1 1 1 1 1 1 1 1 1
symmnumber: 1
zpe: 626744.9 jmol-1
zpe.correction: 0.238715 hartree
zpe.thermalcorrener: 0.254638 hartree
zpe.thermalcorrenthalpy: 0.255582 hartree
zpe.thermalcorrgfe: 0.192991 hartree
zpe.sumelectzpe: -912.520152 hartree
zpe.sumelectthermal: -912.504229 hartree
zpe.sumelectthermalent: -912.503284 hartree
zpe.sumelectthermalfe: -912.565876 hartree
dipole: -0.3893 4.7544 -0.4386
dipole: 4.7904
quadrupole: -80.1923 -110.6753 -118.5074
quadrupole: -12.5011 2.0927 2.1094
quadrupole: 22.9327 -7.5503 -15.3824 -12.5011 2.0927 2.1094
hfenergy: -912.7588666 hartree
pointgroup: C01 [X(C15H12N2O3)]
dipole: -0.1305895 -1.8772034 0.1054026 debye
polarizability: 413.3343082|-1.8528527|184.3975073|-6.7542487|8.6573093|83.3486633 unknown
InChI: InChI=1S/C15H12N2O3/c18-15(12-4-2-1-3-5-12)17-16-9-11-6-7-13-14(8-11)20-10-19-13/h1-9,17H,10H2
charge 0 multiplicity 1
32 atoms
O  4.762248 1.820083 -0.243012
O  6.206444 -0.091054 -0.056667
O  -2.223843 1.965879 0.075122
N  -0.214391 0.003113 0.043077
N  -1.56421 -0.288949 0.089738
C  3.996883 0.636578 -0.097187
C  4.852929 -0.487278 0.011756
C  2.074125 -0.794433 0.096408
C  2.613065 0.525553 -0.059344
C  4.351847 -1.782022 0.163982
C  6.183144 1.391986 -0.213629
C  2.939932 -1.918279 0.204723
C  0.625581 -1.007599 0.146434
C  -3.951273 0.254146 0.026991
C  -2.524825 0.742342 0.055939
C  -4.948116 1.135011 0.520644
C  -4.340139 -1.005992 -0.502245
C  -6.305063 0.752987 0.513833
C  -5.700541 -1.385269 -0.51291
C  -6.685094 -0.510857 0.001997
H  1.943522 1.384854 -0.141117
H  5.017434 -2.644293 0.247305
H  2.507363 -2.91848 0.323544
H  6.681957 1.849545 0.65786
H  6.661176 1.655725 -1.172371
H  0.282702 -2.056083 0.271434
H  -4.632961 2.114378 0.895223
H  -3.599624 -1.678411 -0.953027
H  -1.884148 -1.260734 0.218093
H  -7.066292 1.437763 0.903002
H  -5.993447 -2.353305 -0.933903
H  -7.739983 -0.80661 -0.006798
