program: Gaussian 09
title: 000220509
version: EM64L-G09RevD.01
frameworkgroup: C1[X(C20H28O3)]
method: RPBEPBE
basis: SDD
operation: Freq
keyword: #pfreq=noraman
keyword: PBEPBE/SDD
title: #p freq=noraman PBEPBE/SDD
converged: YES YES NO NO
title: Mulliken charges:
elementType: O O O C C C C C C C C C C C C C C C C C C C C H H H H H H H H H H H H H H H H H H H H H H H H H H H H
charge: -0.309315 -0.442823 -0.234609 0.238222 -0.220288 -0.186108 0.387811 -0.143563 0.121571 -0.555423 0.215341 -0.546764 -0.444380 -0.511823 0.558310 -0.653486 -0.482899 -0.870178 -0.767143 -0.797685 -0.570939 -0.579929 0.178811 0.254913 0.227432 0.225717 0.230087 0.235693 0.228459 0.222686 0.234143 0.217585 0.218759 0.222973 0.223578 0.238496 0.216902 0.224161 0.224019 0.291595 0.211158 0.263926 0.226103 0.217641 0.210567 0.239350 0.239371 0.248904 0.234608 0.255074 0.333389
chargesum: 0.00000
title: Mulliken charges with hydrogens summed into heavy atoms:
elementType: O O O C C C C C C C C C C C C C C C C C C C C
charge: -0.309315 -0.109434 -0.234609 0.238222 0.034625 0.041324 0.387811 0.082154 0.121571 -0.089644 0.215341 -0.095619 0.007348 -0.070091 0.558310 -0.191412 -0.041836 -0.143407 -0.059472 -0.108397 -0.087427 -0.324856 0.178811
polarizability: 2.67042940e+02 5.70096648e-01 1.93695060e+02 -1.76914415e+01 -2.01895531e+00 1.80837839e+02
1716.lowfreq: -11.2383 -8.2206 0.0003 0.0007 0.0008 7.9745 27.3230 46.0870 84.2345
frequency: 27.3089 46.0535 84.2101 93.9943 116.1653 138.8381 170.1448 185.7083 196.1553 208.1436 228.6296 237.6620 242.3352 256.9632 264.6023 271.3688 291.2183 300.8441 310.0366 332.0385 355.4687 360.7372 374.5467 380.5220 395.2843 401.1859 414.3043 440.9633 455.6820 466.6430 488.4529 503.1290 532.6760 534.4354 559.3715 564.4341 581.7798 616.2259 649.4095 662.2341 678.2602 710.8079 767.5155 777.1834 791.6153 794.5964 828.7497 837.4466 849.6108 874.7498 885.4742 898.1025 905.0044 920.8336 934.9402 940.2939 949.8599 953.5255 974.6065 988.0374 997.3483 1019.8352 1027.8334 1032.4926 1062.7153 1067.2770 1071.1976 1078.1552 1086.7552 1098.2964 1105.2324 1114.1928 1131.4820 1140.0125 1157.3275 1166.6794 1171.7734 1179.1859 1186.7389 1200.5850 1207.9521 1218.3903 1224.0717 1229.7055 1246.2584 1268.3948 1272.3087 1278.7137 1283.2317 1291.2929 1305.6700 1313.1224 1323.0117 1324.3657 1326.7278 1331.7353 1340.5209 1346.7080 1355.8164 1368.6314 1381.6883 1384.7018 1394.9796 1399.2646 1445.0101 1445.9792 1457.1184 1463.0872 1464.5051 1468.9599 1469.4348 1473.1702 1476.8633 1485.8447 1487.3753 1488.7436 1510.3505 1585.9457 1627.5755 2928.6805 2964.4347 2968.7352 2974.7584 2976.8245 2978.6649 2980.8495 2984.9854 2986.2637 2994.3158 2994.7118 3002.9505 3032.2272 3041.0533 3045.2578 3045.9203 3048.1448 3057.0221 3065.1112 3069.3861 3085.8850 3091.5774 3096.7300 3096.8120 3109.2539 3111.5973 3121.2748 3558.7265
redmass: 4.5972 4.8032 4.0697 2.3049 3.1469 3.8854 2.7855 2.5466 1.7893 2.4986 2.0822 2.2781 2.6622 1.7877 1.3787 1.6909 2.3671 3.2091 3.2498 2.1001 3.8659 2.1399 2.7032 2.4000 2.8476 2.2524 1.9757 3.2496 3.6025 4.0455 3.2666 3.8330 2.7033 2.9016 3.2776 3.6173 3.8935 4.1041 3.6292 2.9647 4.8677 3.7713 3.2656 2.3485 1.8098 2.4459 2.9344 2.0680 2.5527 2.2421 1.4822 1.9936 2.2221 1.8419 1.7887 1.8348 1.8190 2.3776 2.1401 2.3600 2.7503 1.7471 1.8181 1.6689 2.2313 1.7372 1.9526 2.0788 2.2332 2.3240 1.7138 1.9624 1.7644 2.5251 2.5800 1.7119 2.0454 1.5147 1.9704 1.9062 1.5464 1.4552 1.6182 1.5325 1.5837 1.3921 1.4477 1.7600 1.6249 1.6863 1.6340 1.9496 1.4311 1.6099 1.5018 1.7980 1.5596 2.1349 1.4306 1.2832 1.2372 1.2718 1.3505 1.5171 1.0754 1.0812 1.0810 1.0724 1.0544 1.0708 1.0859 1.0817 1.0668 1.0762 1.0617 1.0574 1.0519 9.9576 7.7646 1.0802 1.0811 1.0664 1.0404 1.0624 1.0585 1.0622 1.0629 1.0615 1.0357 1.0361 1.0639 1.1000 1.0995 1.0992 1.1010 1.0988 1.0983 1.0963 1.1020 1.0996 1.0991 1.0992 1.0889 1.1002 1.0946 1.0912 1.0652
irintensity: 0.6128 3.6021 1.2608 0.5065 0.6478 1.2272 3.5461 0.7086 1.6062 0.5105 1.9798 1.6106 1.9497 1.6502 0.4431 1.5037 0.9358 15.3402 0.2104 8.7943 6.7257 54.1473 2.4996 6.4036 18.6576 16.1590 43.0891 4.1282 2.3761 2.3412 3.5394 8.4502 0.2338 1.1170 17.6947 4.1420 4.4461 2.4526 0.6695 5.8965 1.0513 16.0210 8.2489 11.6569 2.3033 1.6208 10.3936 1.0323 3.1247 2.7258 16.2792 15.3662 53.8867 8.2654 4.5297 1.8427 20.9091 3.2516 5.8958 7.6958 1.6595 8.8278 6.1967 8.5271 4.0536 18.4887 19.0182 60.5171 7.7713 3.7921 8.1742 2.0802 7.9136 1.8003 3.3521 3.9861 15.2309 20.6734 16.1876 8.4709 14.8801 5.7647 3.4686 23.0845 20.1424 11.2263 6.5899 29.1295 1.1799 2.3680 1.1122 11.7292 11.2443 2.3353 0.2644 40.2875 5.7975 8.4198 1.8941 8.1923 20.3299 52.0202 10.2539 2.4195 24.2815 6.9164 9.2071 7.9757 4.5433 15.4213 8.2111 4.0828 13.2940 0.9980 6.0202 8.6265 7.2834 171.0512 185.7369 12.8231 10.6688 9.9131 39.0066 33.0628 25.8157 19.7028 16.9091 31.8540 24.3288 23.1899 42.7555 13.7689 28.1763 20.0331 13.8665 35.4542 37.6039 19.1225 41.4336 30.5037 36.3826 30.4528 26.4386 9.5405 1.7246 9.4382 5.5502
temp: 298.150 k
press: 1.00000 atm
elementType: 8 8 8 6 6 6 6 6 6 6 6 6 6 6 6 6 6 6 6 6 6 6 6 1 1 1 1 1 1 1 1 1 1 1 1 1 1 1 1 1 1 1 1 1 1 1 1 1 1 1 1
symmnumber: 1
zpe: 1150063.6 jmol-1
zpe.correction: 0.438036 hartree
zpe.thermalcorrener: 0.459362 hartree
zpe.thermalcorrenthalpy: 0.460306 hartree
zpe.thermalcorrgfe: 0.390431 hartree
zpe.sumelectzpe: -1002.786160 hartree
zpe.sumelectthermal: -1002.764834 hartree
zpe.sumelectthermalent: -1002.763890 hartree
zpe.sumelectthermalfe: -1002.833765 hartree
dipole: 3.2543 1.6875 -2.1946
dipole: 4.2724
quadrupole: -177.4186 -133.8124 -142.7351
quadrupole: 9.1779 9.2586 -4.0194
quadrupole: -26.0966 17.5096 8.5870 9.1779 9.2586 -4.0194
hfenergy: -1003.2241959 hartree
pointgroup: C01 [X(C20H28O3)]
dipole: -1.2684958 -0.6681401 -0.877477 debye
polarizability: 267.0513895|1.5944339|193.6255655|17.5465951|2.6690516|180.8988835 unknown
InChI: InChI=1S/C20H28O3/c1-17-8-6-13(21)10-12(17)4-5-15-14-7-9-19(3,22)18(14,2)11-16-20(15,17)23-16/h10,14-16,22H,4-9,11H2,1-3H3
charge 0 multiplicity 1
51 atoms
O  -0.126135 1.644845 -1.342448
O  -5.101451 0.862388 0.455684
O  5.559198 -0.137344 1.719961
C  0.382933 0.472967 -0.503848
C  -0.421547 -0.838512 -0.747374
C  -0.351063 1.636691 0.149388
C  -2.621476 0.461854 -0.047428
C  -1.770644 -0.835809 0.019602
C  1.961367 0.439802 -0.555283
C  -1.800189 1.587358 0.621023
C  -3.932164 -0.000252 0.726613
C  -2.767431 -1.974613 -0.328934
C  0.341418 -2.122527 -0.32142
C  -4.148217 -1.466613 0.195548
C  2.538814 -0.934395 -0.188996
C  1.820455 -2.138322 -0.752219
C  2.5665 1.534051 0.375587
C  -3.023784 0.859333 -1.495672
C  2.377302 0.714549 -2.044692
C  -3.833316 0.03945 2.261691
C  4.097374 1.432972 0.532451
C  3.685434 -1.080145 0.550464
C  4.520246 0.046124 1.013887
H  -0.613372 -0.894142 -1.839706
H  0.249378 2.399886 0.659878
H  -1.495011 -0.954847 1.091451
H  -1.774961 1.442378 1.718929
H  -2.263273 2.578239 0.442541
H  -2.480492 -2.935671 0.132157
H  -2.792769 -2.134706 -1.424265
H  -0.180136 -3.000892 -0.744528
H  0.295236 -2.223806 0.781772
H  -4.905869 -1.463681 -0.610817
H  -4.548939 -2.10897 0.998978
H  1.87713 -2.122105 -1.860411
H  2.311228 -3.070479 -0.419491
H  2.113525 1.437406 1.381915
H  2.30111 2.53421 -0.015329
H  -3.613126 1.795236 -1.479003
H  -2.132234 1.053583 -2.109964
H  -3.628411 0.075861 -1.992045
H  2.036351 1.719381 -2.340422
H  3.472228 0.643644 -2.165231
H  1.911459 -0.011402 -2.733856
H  -2.969317 -0.536472 2.637393
H  -3.757413 1.079498 2.62183
H  -4.752099 -0.395319 2.691397
H  4.479063 2.186918 1.243239
H  4.605249 1.624794 -0.434462
H  4.068089 -2.082249 0.784182
H  -5.319549 0.806352 -0.509116
