program: Gaussian 09
title: 000220467
version: EM64L-G09RevD.01
frameworkgroup: C1[X(C11H14N4S2)]
method: RPBEPBE
basis: SDD
operation: Freq
keyword: #p
keyword: freq=noraman
keyword: PBEPBE/SDD
title: #p freq=noraman PBEPBE/SDD
converged: YES YES NO NO
title: Mulliken charges:
elementType: S S N N N N C C C C C C C C C C C H H H H H H H H H H H H H H
charge: 0.219247 0.149251 -0.417091 -0.031747 -0.605099 -0.324293 -0.297269 -0.629098 0.278460 0.020534 -0.185911 -0.682604 -0.357579 -0.340777 -0.216108 -0.229658 -0.075736 0.257253 0.219215 0.292676 0.282041 0.304317 0.256586 0.313271 0.232043 0.244585 0.222807 0.223485 0.319527 0.329216 0.228457
chargesum: 0.00000
title: Mulliken charges with hydrogens summed into heavy atoms:
elementType: S S N N N N C C C C C C C C C C C
charge: 0.219247 0.149251 -0.103819 -0.031747 0.043644 -0.095836 0.179198 -0.054381 0.278460 0.020534 -0.185911 -0.121701 -0.125536 -0.096193 0.006699 -0.006173 -0.075736
polarizability: 3.01094256e+02 -2.31787497e+01 1.53474298e+02 -7.59049466e+00 -3.41653343e+00 1.16677036e+02
1716.lowfreq: -3.5317 -0.0020 -0.0017 0.0008 2.5633 4.6327 10.7432 22.6741 27.6203
frequency: 10.5176 22.6592 27.4667 39.5457 45.0024 85.4982 96.3292 115.9037 133.1195 187.8798 240.6493 246.1882 286.1801 299.4508 319.9064 341.3110 400.3011 405.1089 419.0341 426.5669 457.6174 487.4032 559.8230 560.7993 578.7536 584.9735 586.4265 612.9835 645.5068 650.9486 724.4565 732.4244 740.5089 749.7714 766.8698 794.4775 808.7601 854.5247 875.8154 930.7777 931.0755 972.6582 982.0625 1008.0489 1024.2000 1036.0063 1044.5428 1054.3958 1106.4048 1125.0022 1151.0115 1162.3051 1207.2382 1233.2342 1255.2322 1258.8867 1275.6598 1278.3912 1286.1587 1298.7363 1333.7940 1336.3840 1412.9743 1414.8416 1417.6778 1447.2780 1460.4132 1469.6947 1477.5318 1594.9459 1615.5097 1631.0707 1645.2828 3004.7149 3024.0032 3044.7555 3066.0092 3106.0667 3124.9216 3130.0495 3142.8042 3158.1569 3171.9695 3376.0438 3527.5360 3598.8138 3675.5355
redmass: 5.4418 4.9220 4.6570 5.6836 7.3249 2.1860 2.8414 5.6612 6.7224 5.7104 2.8312 4.4746 4.9518 6.1870 3.0081 1.2404 3.0347 1.5902 5.0893 2.9742 6.7377 5.4314 3.0326 1.2414 3.8516 7.9891 2.7375 6.7057 8.1884 5.7937 1.3733 1.1692 5.0092 1.3336 3.6009 5.1743 1.2761 1.4903 6.6053 8.0991 1.4069 1.3031 1.6879 2.0547 1.4489 5.0549 1.5720 3.1209 1.7044 1.0685 1.7597 1.2249 2.8598 1.1754 1.2416 3.0948 1.7833 2.2868 1.4640 1.1041 1.3824 2.9426 2.8210 1.0972 3.9732 1.0851 4.3290 1.0921 2.7825 6.8552 1.3090 7.4953 3.6185 1.0600 1.0573 1.0572 1.1022 1.1076 1.1089 1.0852 1.0904 1.0959 1.0991 1.0772 1.0449 1.0813 1.1043
irintensity: 0.8100 2.1746 9.5040 0.9834 3.9140 4.2369 0.9522 0.1431 2.8660 1.5742 11.4667 6.7199 0.4768 1.2263 6.9320 16.1670 64.3766 242.9255 17.1159 10.7918 1.3029 0.0836 20.8116 87.3661 0.0143 7.5875 66.4584 0.9463 28.3591 8.7160 84.1542 13.7886 4.3721 110.8104 6.9099 1.2187 0.1251 0.1239 2.4043 6.4797 4.4095 0.0355 135.7970 8.4203 1.5700 0.7019 5.5001 8.7409 3.0702 0.4908 18.7622 16.5778 12.2377 1.3222 4.2871 71.8300 21.7026 153.8004 72.4350 14.7349 25.0000 61.1167 5.3666 37.3548 308.8714 16.9739 15.8287 8.9385 30.8020 1.0847 95.6639 3.7179 258.2087 8.6357 20.0745 8.7518 5.5503 1.4860 12.0425 0.1897 13.3848 28.9958 20.7873 21.0079 40.4072 47.5958 23.9044
temp: 298.150 k
press: 1.00000 atm
elementType: 16 16 7 7 7 7 6 6 6 6 6 6 6 6 6 6 6 1 1 1 1 1 1 1 1 1 1 1 1 1 1
symmnumber: 1
zpe: 627754.0 jmol-1
zpe.correction: 0.239099 hartree
zpe.thermalcorrener: 0.256756 hartree
zpe.thermalcorrenthalpy: 0.257701 hartree
zpe.thermalcorrgfe: 0.189009 hartree
zpe.sumelectzpe: -1441.445942 hartree
zpe.sumelectthermal: -1441.428284 hartree
zpe.sumelectthermalent: -1441.427340 hartree
zpe.sumelectthermalfe: -1441.496032 hartree
dipole: 2.7653 -2.4546 1.3107
dipole: 3.9230
quadrupole: -72.7527 -109.8277 -114.8415
quadrupole: 2.0887 9.5773 -2.5175
quadrupole: 26.3879 -10.6871 -15.7009 2.0887 9.5773 -2.5175
hfenergy: -1441.6850405 hartree
pointgroup: C01 [X(C11H14N4S2)]
dipole: 1.1087442 -0.7287272 0.7885509 debye
polarizability: 300.3398048|-26.7074347|147.0291988|-5.3475751|-13.9278126|123.8765871 unknown
InChI: InChI=1S/C11H14N4S2/c12-10(13)16-6-3-7-17-11-14-8-4-1-2-5-9(8)15-11/h1-2,4-5,12,14H,3,6-7,13H2
charge 0 multiplicity 1
31 atoms
S  0.286501 -1.604538 0.324999
S  5.482791 -0.143968 -1.314641
N  -2.475291 -1.433239 0.699115
N  -1.570235 0.404601 -0.31989
N  7.373233 0.027986 0.587528
N  5.201708 0.960842 1.184863
C  2.797444 -0.712912 -0.544958
C  1.338597 -0.232005 -0.47091
C  -3.556106 -0.562614 0.464047
C  -2.968952 0.583735 -0.175022
C  -1.322269 -0.800984 0.210919
C  3.670955 0.370921 -1.203292
C  -4.934878 -0.656846 0.734068
C  -3.785282 1.671482 -0.555326
C  -5.734372 0.442289 0.34523
C  -5.169101 1.586041 -0.288069
C  6.038828 0.366275 0.382553
H  3.188362 -0.903543 0.470602
H  2.863463 -1.654507 -1.121663
H  1.220357 0.664739 0.157042
H  0.89738 -0.033677 -1.460637
H  3.667719 1.296258 -0.603076
H  3.372203 0.583917 -2.244143
H  -2.514445 -2.348874 1.142852
H  -5.377774 -1.532274 1.220521
H  -3.346746 2.548264 -1.041352
H  -6.812857 0.413097 0.535739
H  -5.824923 2.416071 -0.572742
H  7.82964 0.254845 1.468688
H  7.914888 -0.449391 -0.1311
H  5.576861 1.229808 2.112852
