program: Gaussian 09
title: 000220461
version: EM64L-G09RevD.01
frameworkgroup: C1[X(C5H8N2O2)]
method: RPBEPBE
basis: SDD
operation: Freq
keyword: #pfreq=noraman
keyword: PBEPBE/SDD
title: #p freq=noraman PBEPBE/SDD
converged: YES YES NO NO
title: Mulliken charges:
elementType: O O N N C C C C C H H H H H H H H
charge: -0.242742 -0.256903 -0.383823 -0.604495 -0.142548 -0.451790 -0.510967 0.158503 0.199499 0.258045 0.242510 0.213826 0.254439 0.243967 0.353023 0.343427 0.326031
chargesum: 0.00000
title: Mulliken charges with hydrogens summed into heavy atoms:
elementType: O O N N C C C C C
charge: -0.242742 -0.256903 -0.030800 0.064963 0.115496 0.004546 -0.012561 0.158503 0.199499
polarizability: 8.84857670e+01 3.79432239e+00 7.38825145e+01 2.32402420e+00 1.80777365e+00 4.64054625e+01
1716.lowfreq: -0.0009 -0.0008 0.0004 6.2147 10.1476 13.1135 51.3761 94.6621 147.6448
frequency: 51.2924 94.6354 147.6400 186.1014 310.5750 375.7549 444.9409 496.2710 512.5739 535.4045 585.6024 598.5752 629.3410 657.3225 713.5660 817.9761 849.9759 900.3209 960.3210 1005.2326 1043.5192 1054.9584 1117.7839 1148.4527 1198.2984 1247.6665 1267.7563 1278.4733 1291.9498 1315.4986 1354.6805 1384.7003 1454.0395 1474.4925 1594.7415 1646.6998 1673.3543 2922.2121 3011.4530 3016.1120 3076.5222 3100.9498 3515.7724 3562.1753 3668.7294
redmass: 4.8855 6.1288 2.4168 3.6703 4.7216 3.8199 3.9114 1.7380 1.4164 2.1655 2.3782 2.0464 1.6797 2.4121 3.2683 2.3791 2.9845 2.5956 2.4947 2.1461 2.0900 1.9176 1.6565 2.0062 1.3319 2.1436 1.2990 1.4061 1.3769 1.8145 2.7037 2.3813 1.0846 1.0980 1.4969 3.4849 9.1280 1.0824 1.0592 1.0666 1.1038 1.0999 1.0448 1.0786 1.1044
irintensity: 4.1508 1.7221 1.9248 7.8966 4.3169 10.1366 11.0793 6.3072 108.9463 58.4640 18.9806 93.1255 32.6953 147.2106 13.2186 4.1581 1.6548 2.5018 0.4600 8.0177 3.4479 1.4375 13.3541 12.0911 11.3567 116.7964 16.0143 31.6024 12.6035 32.9783 107.5607 10.5864 8.6876 6.6964 71.3674 331.1860 424.0747 44.3841 30.7490 12.0660 22.7023 17.5229 32.8523 61.7842 29.4955
temp: 298.150 k
press: 1.00000 atm
elementType: 8 8 7 7 6 6 6 6 6 1 1 1 1 1 1 1 1
symmnumber: 1
zpe: 354659.4 jmol-1
zpe.correction: 0.135083 hartree
zpe.thermalcorrener: 0.143575 hartree
zpe.thermalcorrenthalpy: 0.144519 hartree
zpe.thermalcorrgfe: 0.101238 hartree
zpe.sumelectzpe: -454.623635 hartree
zpe.sumelectthermal: -454.615143 hartree
zpe.sumelectthermalent: -454.614199 hartree
zpe.sumelectthermalfe: -454.657480 hartree
dipole: 4.4360 5.7564 1.1901
dipole: 7.3641
quadrupole: -59.9997 -53.0679 -52.2295
quadrupole: 2.1553 -1.4798 -1.6507
quadrupole: -4.9007 2.0312 2.8696 2.1553 -1.4798 -1.6507
hfenergy: -454.758718 hartree
pointgroup: C01 [X(C5H8N2O2)]
dipole: 1.825681 2.2286485 0.3068376 debye
dipolederiv: -1.1535275 -0.2317712 -0.2008968 -0.4336193 -0.6585085 -0.0637028 -0.1881352 -0.0133784 -0.4263606 -0.6583943 0.1300507 -0.0016936 -0.0714038 -1.0339599 0.0383803 0.0740934 -0.0175637 -0.3513543 -1.1252063 -0.0670465 -0.2232585 0.292595 -0.4199633 0.0842755 -0.2809253 0.0336562 -0.5701112 -0.887817 -0.4806571 -0.0278592 -0.3290335 -0.5901624 0.0379468 0.0080153 0.0628672 -0.6683286 0.21 0.1989292 0.0904762 0.4671185 0.1212248 0.1363984 0.1095258 0.0270759 0.3589576 -0.0282596 0.0738837 -0.0146252 -0.0556176 0.0968675 0.0687436 0.0182494 0.0543157 0.1012557 0.0193803 -0.0880756 -0.0157739 -0.0842341 -0.3375774 0.0833381 -0.0371385 0.0931524 0.1368636 1.7028477 0.2586214 0.4867661 0.1047989 0.8959315 -0.1661486 0.5573619 -0.0801691 0.3832172 1.2345456 0.2154076 -0.1028596 0.245848 1.3682183 -0.0455034 -0.2285271 -0.0140549 0.18892 -0.0544583 -0.0158514 -0.0310656 -0.0828397 0.0018459 -0.0794533 -0.0723966 -0.0652795 -0.1385306 0.0178259 0.0034979 0.0713306 0.0241084 0.0661596 -0.0415291 0.0755883 0.0023316 -0.0874909 0.0131237 -0.1099973 -0.0239163 -0.0957632 -0.1112494 -0.0433011 -0.0459533 -0.0771454 0.055233 0.0163222 0.0227841 -0.0633621 0.0100461 0.0894556 0.0304972 -0.0804994 0.0715603 -0.0405985 0.0154447 0.0221669 0.055407 0.0483373 0.0256039 -0.0552384 0.0889309 -0.0949866 -0.0069144 0.2465305 0.0159332 -0.0700744 -0.0726263 0.2001492 0.012714 -0.0754686 0.0166708 0.331225 0.1817492 0.0183347 0.0316699 -0.0015875 0.1673742 -0.0011521 0.0274855 0.0027952 0.3731049 0.2498932 0.0337896 0.0397352 0.0338728 0.1185905 0.0037349 0.0497935 -0.0018478 0.3609122 unknown
polarizability: 87.9261671|3.7213225|73.3978153|6.3120812|-2.3285885|47.4497617 unknown
InChI: InChI=1S/C5H8N2O2/c6-5(9)3-1-2-4(8)7-3/h3,7H,1-2,6H2
charge 0 multiplicity 1
17 atoms
O  -2.833113 -0.844537 -0.375397
O  1.981907 -1.64239 0.26976
N  -0.614959 -0.713092 0.429818
N  2.880268 0.497617 0.139745
C  0.463679 0.262863 0.599761
C  0.03069 1.429884 -0.350441
C  -1.512418 1.294226 -0.411425
C  -1.775215 -0.204411 -0.13933
C  1.832216 -0.387044 0.306677
H  0.501998 0.630418 1.650068
H  0.462542 1.267982 -1.354431
H  0.362601 2.415397 0.019906
H  -1.946899 1.580018 -1.38207
H  -2.016899 1.891189 0.371394
H  -0.466313 -1.704375 0.629664
H  3.815522 0.121243 -0.015761
H  2.744393 1.50721 0.139063
