program: Gaussian 09
title: 000220459
version: EM64L-G09RevD.01
frameworkgroup: C1[X(C11H11NO2)]
method: RPBEPBE
basis: SDD
operation: Freq
keyword: #p
keyword: freq=noraman
keyword: PBEPBE/SDD
title: #p freq=noraman PBEPBE/SDD
converged: NO YES NO YES
title: Mulliken charges:
elementType: O O N C C C C C C C C C C C H H H H H H H H H H H
charge: -0.266024 -0.282471 -0.208110 0.219989 0.401527 -0.332845 -0.543248 -0.261264 0.119502 0.322458 -0.369163 -0.293938 -0.664744 -0.535281 0.251065 0.257546 0.242385 0.244945 0.249734 0.233966 0.291478 0.233967 0.220420 0.220420 0.247687
chargesum: 0.00000
title: Mulliken charges with hydrogens summed into heavy atoms:
elementType: O O N C C C C C C C C C C C
charge: -0.266024 -0.282471 -0.208110 0.219989 0.401527 -0.081780 -0.285702 -0.018878 0.119502 0.322458 -0.124218 -0.044204 0.094666 0.153246
polarizability: 2.25342804e+02 -8.88004985e+00 1.35153407e+02 2.14077373e-02 4.61436891e-03 6.16983598e+01
1716.lowfreq: -1.2201 -0.0010 -0.0006 0.0004 5.3799 16.2188 62.0488 102.3918 107.7376
frequency: 62.0418 102.3886 107.7362 177.1288 190.2017 219.9985 230.0978 262.4816 305.0945 327.1676 366.6730 383.4703 408.4321 454.2838 485.3814 524.2614 528.5421 565.5600 583.9498 643.6041 687.9303 710.4666 761.2584 790.8611 803.8143 834.4582 878.3537 895.8575 916.0034 926.2237 986.3180 1006.3965 1056.9946 1106.4499 1111.7494 1121.4104 1143.7758 1161.2180 1173.3292 1188.9834 1251.1113 1267.6679 1289.7504 1327.2343 1370.7680 1402.5892 1423.4012 1434.3467 1446.5842 1467.3544 1473.6627 1475.6038 1498.2409 1500.1279 1561.6697 1566.4876 1631.6312 1648.2308 2956.0460 2983.6923 3042.9500 3068.5727 3115.1627 3125.5195 3131.4581 3152.3593 3152.8221 3176.7398 3182.2739
redmass: 4.1846 5.1951 3.1434 3.7725 4.4193 1.7119 1.0631 1.7346 3.8181 5.4176 4.8267 4.4145 3.6798 5.7055 3.1701 4.4729 6.0443 6.1825 2.8055 5.2939 3.4761 6.2976 3.3160 6.2655 1.6174 1.5861 3.0133 1.6263 4.8704 1.3464 1.3182 4.0331 4.0574 1.9097 1.2585 1.3146 1.4686 1.4613 1.6211 1.5795 2.0055 2.2460 2.1305 3.4309 1.9882 6.3497 1.2628 1.6775 2.0754 1.0502 1.0981 1.1232 2.7808 1.0452 7.0547 6.8488 7.1026 7.4155 1.0333 1.0346 1.1040 1.1022 1.0987 1.0990 1.0902 1.0880 1.0921 1.0949 1.0962
irintensity: 0.0964 14.7377 0.0269 0.9375 1.3681 2.6380 0.3737 2.4478 5.6249 0.4220 0.8425 9.4180 0.9292 4.1078 6.8244 2.0955 5.9101 22.2899 1.6869 5.7832 2.4697 9.8809 0.5368 1.2069 59.1933 18.0273 8.6949 48.3818 6.2813 1.5143 0.8828 68.7163 15.9151 63.3523 0.1384 0.2552 4.0098 33.2482 17.2826 37.3636 88.6667 115.5798 6.5553 3.1422 11.1281 23.2459 10.9327 74.7626 75.5269 13.7341 95.2239 9.3688 56.8118 19.2803 238.9540 39.7927 183.7175 92.6864 74.8766 41.3954 50.5066 26.9808 1.3424 25.3225 10.6640 8.8267 3.8104 8.5305 5.4379
temp: 298.150 k
press: 1.00000 atm
elementType: 8 8 7 6 6 6 6 6 6 6 6 6 6 6 1 1 1 1 1 1 1 1 1 1 1
symmnumber: 1
zpe: 516274.8 jmol-1
zpe.correction: 0.196639 hartree
zpe.thermalcorrener: 0.208715 hartree
zpe.thermalcorrenthalpy: 0.209659 hartree
zpe.thermalcorrgfe: 0.158773 hartree
zpe.sumelectzpe: -629.969024 hartree
zpe.sumelectthermal: -629.956948 hartree
zpe.sumelectthermalent: -629.956004 hartree
zpe.sumelectthermalfe: -630.006890 hartree
dipole: -5.2106 1.9334 -0.0005
dipole: 5.5578
quadrupole: -91.3268 -69.0392 -85.2102
quadrupole: -5.6040 -0.0016 0.0005
quadrupole: -9.4681 12.8196 -3.3515 -5.6040 -0.0016 0.0005
hfenergy: -630.1656625 hartree
pointgroup: C01 [X(C11H11N1O2)]
dipole: -2.0612564 -0.7296618 0.0002017 debye
dipolederiv: -1.9520089 -0.0891476 0.0002075 0.1594552 -0.2870333 -0.0000192 0.0002344 0.000004 -0.2977622 -1.5739196 -0.0232283 0.0001121 0.3740415 -0.4522607 -0.0000462 0.0002961 -0.0000058 -0.3781702 -1.1419226 0.1957365 0.0001677 -0.3047856 -0.5012823 0.0000113 0.0000786 -0.0000902 -0.152348 0.6867703 -0.3367079 -0.000132 -0.0623381 -0.1658375 -0.000019 -0.000092 0.0000198 0.0628363 -0.1323807 -0.1469377 0.0000082 -0.0746006 -0.1645513 -0.0000076 0.0000358 0.0000095 0.0219294 -0.0309546 0.2670842 0.0000066 -0.1160007 0.1346855 0.0000356 -0.0000363 -0.0000183 -0.1776911 -0.145266 0.1943329 0.0000103 -0.1874064 0.1184071 0.0000488 -0.0000233 -0.0000035 -0.1760432 0.4384494 0.1200724 -0.0000498 0.1811038 0.2698803 -0.0000021 -0.000066 0.0000083 -0.1136342 1.8395642 0.0800617 -0.0001679 -0.22638 0.5288748 0.0000528 -0.0002919 -0.0000001 0.1813316 1.5764836 -0.1577601 -0.00021 -0.7114577 -0.1858576 0.0000637 -0.0002588 0.0000059 0.0844939 -0.3541619 -0.1923509 0.0000004 0.3955101 0.1033101 -0.000029 0.0000486 0.0000451 -0.1899795 -0.3889293 0.0455958 0.0000261 0.461309 -0.0619005 -0.0000567 0.0000667 0.0000228 -0.168079 0.0213466 -0.1315234 0.0000176 -0.1076424 0.3717134 0.0000209 0.0000231 0.000036 0.2195097 0.7956896 0.1387837 -0.0000486 0.5170944 0.3374752 -0.0000668 -0.0000127 -0.0000164 0.3322787 0.0762085 0.0607869 0.000014 0.0431723 -0.0601435 -0.0000182 0.0000142 -0.0000169 0.1590015 0.0903541 0.0151098 0.0000117 0.0580176 -0.0370987 -0.0000232 0.0000097 -0.0000175 0.1654454 0.0673488 0.0942285 0.0000173 0.0116369 -0.0833207 -0.0000139 0.000005 -0.0000312 0.1437122 -0.0104535 -0.0941261 0.0000191 -0.1069159 0.0170073 0.0000056 0.0000184 0.0000007 0.1623963 0.0121082 -0.0821138 0.0000136 -0.035137 0.0151639 -0.0000059 0.000012 0.0000057 0.168459 0.0980723 -0.0816236 0.0959703 0.0121215 -0.0314967 0.0518886 0.0482874 0.0899048 -0.0590785 -0.0087514 0.1079216 0.000049 -0.0772759 0.1823263 0.0000206 0.0000151 -0.0000056 0.1311688 0.0980188 -0.0816461 -0.0960571 0.0121031 -0.0314405 -0.0518747 -0.0483492 -0.0898547 -0.0590362 0.0369068 0.0198759 -0.0478659 -0.1652295 -0.0334368 0.1152579 0.0230547 0.1115343 -0.0922853 0.0369163 0.0198486 0.0478477 -0.1652455 -0.0333985 -0.115207 -0.0231063 -0.1115266 -0.0923236 -0.1354891 0.0577269 0.0000322 0.1148497 0.0502144 -0.0000165 0.0000365 -0.0000099 0.1238682 unknown
polarizability: 225.589998|7.5166415|134.906213|-0.0213357|0.0049365|61.6983598 unknown
InChI: InChI=1S/C11H11NO2/c1-12-10-5-4-9(14-2)7-8(10)3-6-11(12)13/h3-7H,1-2H3
charge 0 multiplicity 1
25 atoms
O  -3.682819 0.635693 0.000575
O  4.056126 -0.15055 -0.000564
N  1.794462 -0.810976 -0.000299
C  0.421744 -0.495383 -0.000074
C  0.009063 0.883605 0.000092
C  -0.578048 -1.504112 -0.000007
C  -1.370045 1.206765 0.000302
C  1.032532 1.908198 0.000034
C  2.827137 0.18244 -0.000264
C  -2.348651 0.195616 0.000359
C  -1.945268 -1.168239 0.000209
C  2.365333 1.574053 -0.000151
C  2.22704 -2.222046 -0.000556
C  -4.732773 -0.384958 0.000591
H  -0.299182 -2.560731 -0.000103
H  -1.689533 2.254304 0.000424
H  0.723071 2.960015 0.000133
H  -2.686164 -1.973232 0.000263
H  3.158083 2.327016 -0.000212
H  1.860548 -2.746318 0.900466
H  3.327617 -2.221724 -0.000783
H  1.860135 -2.746102 -0.901532
H  -4.678734 -1.02124 0.906028
H  -4.678904 -1.021096 -0.904957
H  -5.677673 0.177699 0.000727
