program: Gaussian 09
title: 000220456
version: EM64L-G09RevD.01
frameworkgroup: C1[X(C12H17NO)]
method: RPBEPBE
basis: SDD
operation: Freq
keyword: #p
keyword: freq=noraman
keyword: PBEPBE/SDD
title: #p freq=noraman PBEPBE/SDD
converged: YES YES NO NO
title: Mulliken charges:
elementType: O N C C C C C C C C C C C C H H H H H H H H H H H H H H H H H
charge: -0.260893 -0.228240 -0.188392 0.198623 -0.422475 0.444288 -0.689014 -0.697487 -0.662506 -0.326194 -0.369845 -0.229169 -0.239020 -0.251222 0.220270 0.241091 0.243065 0.239822 0.220280 0.212212 0.248853 0.216824 0.204825 0.234380 0.226130 0.219436 0.284250 0.232723 0.225640 0.223230 0.228517
chargesum: 0.00000
title: Mulliken charges with hydrogens summed into heavy atoms:
elementType: O N C C C C C C C C C C C C
charge: -0.260893 -0.228240 0.031877 0.198623 0.061681 0.444288 -0.016700 -0.026985 0.017440 -0.041943 -0.137122 -0.003529 -0.015790 -0.022706
polarizability: 1.90863325e+02 -3.18069536e-01 1.40920069e+02 -1.25429869e+00 -1.17378509e+00 8.83158091e+01
1716.lowfreq: -17.0884 -4.3496 0.0001 0.0006 0.0008 6.6051 24.0721 39.7146 64.8433
frequency: 22.7005 39.6330 64.7426 103.4886 146.9826 153.1207 178.3965 187.2646 214.1288 223.0022 262.3779 291.3609 309.2951 334.5329 373.3647 405.2824 423.8517 438.7237 527.3278 567.4552 607.6411 616.3953 691.1095 695.0543 713.4630 763.1232 776.2310 818.5793 829.1535 900.3662 902.7657 924.5314 943.0598 962.3484 963.1088 984.8685 987.7177 1030.5088 1069.4004 1083.7623 1087.7344 1094.2098 1112.5605 1122.3877 1172.7328 1175.1991 1198.6443 1209.1188 1242.3476 1288.3682 1317.9137 1331.5947 1345.3293 1364.2662 1376.0036 1381.8987 1393.3769 1394.7989 1441.8237 1459.0066 1465.9579 1469.1451 1476.6034 1483.8052 1487.3690 1489.3707 1504.5870 1578.5432 1590.9261 1612.2308 2977.1388 2987.3750 2989.5219 3024.8068 3036.0450 3070.1077 3070.9647 3080.0794 3085.7889 3087.1511 3098.6174 3105.2728 3126.6556 3137.2173 3156.2226 3168.5251 3209.3360
redmass: 3.0538 4.8433 2.8346 4.2218 3.7332 2.5273 1.1279 1.1028 2.5213 1.1282 3.5697 3.3899 3.4529 4.1923 2.9110 2.9318 2.4886 4.4662 3.2566 3.7871 3.7602 5.6294 1.9627 3.5783 4.5858 1.9050 1.4922 1.9824 1.3672 1.7276 1.8611 1.1846 2.3572 1.3729 1.4155 2.2018 2.0873 2.3765 2.2145 1.8556 1.6337 1.7992 2.4567 2.2548 1.4437 1.4081 1.1756 2.7937 1.8501 1.3615 1.4304 1.3448 1.3154 1.6777 1.2986 5.9400 1.2392 1.2399 2.3517 1.0450 1.0549 1.0518 1.0517 1.5395 1.2388 1.1105 1.0848 6.9837 6.8436 6.2870 1.0348 1.0361 1.0364 1.0640 1.0813 1.1009 1.0999 1.0999 1.0988 1.1005 1.1015 1.0991 1.0848 1.0900 1.0942 1.0985 1.0941
irintensity: 0.3438 3.0007 0.0402 1.1300 0.5969 0.1263 0.2337 0.2043 1.2547 1.4115 0.3097 1.9553 0.5127 13.6465 1.5963 0.3051 2.3604 4.5886 9.7668 3.3766 2.6720 1.3724 38.5425 8.1935 1.0847 65.7289 15.2244 1.9490 3.6599 2.9131 4.3974 4.5420 8.1979 0.6667 1.6471 0.0601 0.1585 4.5037 56.7331 39.1032 15.4780 42.1230 7.7675 14.1445 8.3131 9.1071 0.9243 53.5656 128.5445 1.2100 36.8485 3.7307 12.5186 95.2000 20.6387 1.2954 71.9673 30.4512 4.9364 5.8083 4.5228 5.4265 11.1705 60.9637 72.5388 1.9530 26.3342 118.7207 45.7625 47.1396 30.2718 35.8471 23.1983 20.3281 18.3679 6.1187 32.1707 47.0307 41.1680 15.6971 44.9747 30.9185 1.0115 15.7405 39.0692 15.9039 1.1579
temp: 298.150 k
press: 1.00000 atm
elementType: 8 7 6 6 6 6 6 6 6 6 6 6 6 6 1 1 1 1 1 1 1 1 1 1 1 1 1 1 1 1 1
symmnumber: 1
zpe: 691494.8 jmol-1
zpe.correction: 0.263376 hartree
zpe.thermalcorrener: 0.278031 hartree
zpe.thermalcorrenthalpy: 0.278975 hartree
zpe.thermalcorrgfe: 0.221087 hartree
zpe.sumelectzpe: -596.394058 hartree
zpe.sumelectthermal: -596.379404 hartree
zpe.sumelectthermalent: -596.378459 hartree
zpe.sumelectthermalfe: -596.436347 hartree
dipole: -0.6660 3.5086 1.7487
dipole: 3.9764
quadrupole: -76.3256 -81.6131 -89.1053
quadrupole: -3.0065 -2.2953 -3.1643
quadrupole: 6.0224 0.7349 -6.7573 -3.0065 -2.2953 -3.1643
hfenergy: -596.6574343 hartree
pointgroup: C01 [X(C12H17N1O1)]
dipole: -0.2031948 1.4397616 0.5773083 debye
polarizability: 190.5451797|-1.9153337|140.4003846|-5.361966|-5.4826169|89.1536397 unknown
InChI: InChI=1S/C12H17NO/c1-4-13(12(14)10(2)3)11-8-6-5-7-9-11/h5-10H,4H2,1-3H3
charge 0 multiplicity 1
31 atoms
O  -1.151998 -1.694723 -0.480701
N  -0.308661 0.379297 0.229314
C  -2.813065 -0.068507 0.238102
C  -1.361987 -0.518845 -0.05395
C  -0.590773 1.790847 0.625877
C  1.081816 -0.010577 0.106219
C  -3.169506 -0.499922 1.690249
C  -3.775278 -0.715977 -0.782645
C  -0.897779 2.734878 -0.558499
C  1.505738 -1.345177 0.357142
C  2.064484 0.963364 -0.223796
C  2.872732 -1.682553 0.276142
C  3.430164 0.614706 -0.298386
C  3.846499 -0.711513 -0.051307
H  -2.916744 1.027451 0.162216
H  -1.429106 1.800767 1.342746
H  0.289241 2.156314 1.18148
H  -3.083133 -1.59685 1.787413
H  -4.208785 -0.210749 1.929965
H  -2.501065 -0.0369 2.440191
H  -3.655992 -1.812018 -0.775178
H  -3.567895 -0.364935 -1.809649
H  -4.82195 -0.463222 -0.532276
H  -0.067507 2.756842 -1.284484
H  -1.804306 2.417522 -1.103378
H  -1.064091 3.764052 -0.189789
H  0.769088 -2.111821 0.596259
H  1.776425 1.995717 -0.441555
H  3.175771 -2.716755 0.474839
H  4.165666 1.384451 -0.558192
H  4.905699 -0.983159 -0.113371
