program: Gaussian 09
title: 000220532
version: EM64L-G09RevD.01
frameworkgroup: C1[X(C20H32Cl4N2O2)]
method: RPBEPBE
basis: SDD
operation: Freq
keyword: #p
keyword: freq=noraman
keyword: PBEPBE/SDD
title: #p freq=noraman PBEPBE/SDD
converged: YES YES NO NO
title: Mulliken charges:
elementType: Cl Cl Cl Cl O O N N C C C C C C C C C C C C C C C C C C C C H H H H H H H H H H H H H H H H H H H H H H H H H H H H H H H H
charge: -0.080936 -0.081648 -0.080611 -0.080427 -0.442723 -0.442840 -0.141411 -0.143277 -0.542757 -0.540833 -0.315307 -0.312592 -0.314142 -0.310687 0.415665 0.411749 0.075823 0.073378 -0.348243 -0.343221 -0.349326 -0.344407 -0.547044 -0.543420 -0.631950 -0.622792 -0.631335 -0.620857 0.222032 0.267260 0.223721 0.267794 0.237023 0.223997 0.236416 0.237720 0.237414 0.223268 0.236261 0.236732 0.264771 0.260627 0.265649 0.260503 0.233581 0.233540 0.220883 0.238822 0.229075 0.220893 0.235852 0.229443 0.219808 0.239123 0.229081 0.217838 0.236295 0.229917 0.360331 0.360497
chargesum: 0.00000
title: Mulliken charges with hydrogens summed into heavy atoms:
elementType: Cl Cl Cl Cl O O N N C C C C C C C C C C C C C C C C C C C C
charge: -0.080936 -0.081648 -0.080611 -0.080427 -0.082392 -0.082342 -0.141411 -0.143277 -0.053465 -0.049318 0.145713 0.161544 0.146541 0.162306 0.415665 0.411749 0.075823 0.073378 -0.083471 -0.082595 -0.083677 -0.083903 -0.313463 -0.309880 0.056831 0.063396 0.056677 0.063194
polarizability: 3.55650318e+02 -3.34770876e-01 2.49226215e+02 4.87439914e+00 1.02471704e+00 2.46653928e+02
1716.lowfreq: -14.4799 -10.4235 -8.7197 -1.5409 0.0010 0.0014 0.0016 1.2716 8.8200
frequency: -14.1758 -10.1023 8.7374 11.2756 26.6972 27.7583 29.6092 32.1116 36.8919 41.8059 52.5954 53.6882 69.0985 106.0513 116.1468 130.3915 131.4613 168.0008 168.8094 182.1836 205.2563 210.1165 223.5520 229.3112 233.3805 238.3047 244.6424 250.1530 263.0157 288.5149 290.7064 301.6381 302.6442 312.5126 313.9824 326.9656 327.4846 344.8344 347.3520 356.1351 384.7135 390.7323 397.8438 402.5732 428.8254 430.8183 444.6659 448.4750 453.7468 470.4289 505.7362 553.2141 574.1550 618.5581 622.3579 633.1738 636.1746 665.8022 682.0552 710.3640 762.5831 822.3983 827.4080 842.5419 864.4689 867.6914 871.1376 873.6113 880.7878 884.6210 919.9278 920.5548 924.4048 924.9179 966.1607 977.0020 1002.4902 1002.7163 1005.0461 1005.6181 1033.6467 1038.3083 1073.9652 1076.6901 1082.0913 1098.4515 1132.7972 1133.7379 1136.2146 1136.4870 1147.1663 1148.2014 1161.2866 1168.2654 1169.1062 1180.4219 1202.5013 1205.8887 1216.9422 1221.1110 1225.3514 1246.4030 1255.1957 1259.6369 1277.5932 1277.7964 1281.4405 1285.0089 1317.2243 1329.2801 1330.8204 1334.4480 1335.3053 1360.1373 1362.2447 1362.8466 1365.3187 1368.7603 1375.1475 1379.3720 1379.6094 1385.3026 1385.9787 1397.8111 1417.3771 1456.5554 1457.0833 1462.4091 1462.7342 1464.2925 1464.7949 1467.2495 1467.4379 1474.8411 1476.3644 1476.8727 1477.4850 1479.2307 1480.5350 1522.4047 1613.4660 1625.6034 2929.0655 2929.1961 2933.9829 2935.0354 2951.0313 2951.9477 2987.2016 2987.3226 2990.6353 2991.2174 3015.8482 3017.8857 3047.6919 3047.8081 3049.2175 3050.4288 3065.6425 3065.6805 3068.2385 3068.6901 3085.1764 3085.2595 3087.7768 3088.0566 3104.7760 3105.0802 3106.6718 3107.0227 3113.0226 3116.0574 3589.9770 3591.0951
redmass: 5.2364 7.0959 11.3877 7.6224 3.8290 7.1201 4.1034 8.8433 6.8223 6.0648 3.7746 3.7691 5.3489 5.1225 5.9037 4.2620 3.9163 4.1625 4.1810 7.0001 3.6362 2.0264 1.9390 1.3028 1.1885 1.5737 1.5144 1.7207 3.0673 2.9264 2.9682 3.3763 3.2115 1.1750 1.1737 2.6932 2.7131 4.1167 3.9259 4.2962 3.1142 3.0383 2.2892 2.8069 3.5758 3.2917 2.3153 2.5281 3.4005 5.4225 4.7189 3.5313 4.8589 4.4169 4.1118 3.8336 3.7393 5.9379 4.9814 4.0239 5.7331 2.8600 3.8331 2.1258 2.2278 1.4964 2.4060 2.4129 2.2755 2.4570 1.4732 1.4479 1.4732 1.4740 1.8625 1.8407 1.4804 1.4839 1.5124 1.5305 2.5306 2.3037 3.6512 2.1830 2.1027 1.9738 2.1977 2.1990 2.3120 2.3196 2.1343 1.9873 1.3122 1.9896 2.0029 1.6127 1.2089 1.1653 1.4956 1.3469 1.5065 1.2938 1.2175 1.2750 1.3688 1.3773 1.6026 2.5458 2.0338 1.3434 1.3214 1.3460 1.3429 1.5073 1.3527 1.3947 1.3561 1.4762 1.3311 1.2390 1.2401 1.2878 1.2593 4.9671 3.1605 1.0452 1.0442 1.0501 1.0492 1.0637 1.0648 1.0573 1.0560 1.0691 1.0686 1.0767 1.0718 1.1001 1.0785 3.1557 7.1124 7.4101 1.0690 1.0690 1.0686 1.0687 1.0632 1.0633 1.0357 1.0357 1.0354 1.0354 1.0968 1.0968 1.0894 1.0894 1.0899 1.0895 1.0911 1.0913 1.0923 1.0925 1.0970 1.0970 1.0972 1.0972 1.1001 1.1002 1.1006 1.1007 1.0906 1.0912 1.0660 1.0663
irintensity: 0.6574 0.0365 0.1934 0.6983 0.3944 0.6567 0.9924 2.2169 0.5860 1.9237 0.3318 0.2869 0.8893 2.4907 1.0601 1.7532 0.9919 1.5503 4.7300 1.6638 1.3186 0.1572 0.4977 3.0228 0.4017 2.2344 0.5049 1.5692 1.7881 1.4927 1.1036 1.9806 11.5770 151.8756 95.7668 1.2755 1.1972 21.6829 2.1796 5.2897 1.3858 1.1535 0.0519 4.0741 6.1842 0.0963 2.9543 10.3208 25.3592 4.6884 11.5324 0.8813 2.2515 4.8765 58.3082 54.6399 69.1773 5.6101 44.9280 9.0590 0.0274 6.6445 4.6076 16.3143 2.4834 45.8901 4.1239 7.8340 5.3931 5.2159 0.5508 0.4164 3.0342 1.2729 19.8847 1.6841 83.5180 30.1218 11.7694 31.3120 105.1868 37.8357 29.1556 106.0416 2.7457 319.3978 0.5452 13.3122 18.9416 3.3056 33.2789 6.8461 1.1688 17.9850 2.3869 70.7805 35.4140 3.2854 8.3403 21.0425 6.1828 0.4729 5.8989 9.3448 14.6297 7.8836 4.2162 12.9266 0.3299 1.5087 1.4425 1.3171 0.9596 17.2925 1.0748 15.6487 1.9830 9.3059 1.8435 10.7897 9.1280 31.8937 8.0525 155.1637 50.2389 38.6134 0.8112 7.8357 8.9757 6.2382 8.2153 7.7651 6.0228 12.5126 5.2218 38.7579 1.9665 4.6760 14.3645 29.4260 2.3609 0.4213 14.8259 19.8685 67.5673 58.6101 45.2200 39.2288 13.3594 13.3493 2.5432 25.5802 14.6657 14.7145 4.2299 3.7301 2.0668 0.9629 8.6520 11.9261 22.9597 25.5783 84.0893 9.8607 34.0831 21.3155 23.1131 22.7488 30.5462 47.5907 21.5806 0.1120 57.0954 0.0120
temp: 298.150 k
press: 1.00000 atm
elementType: 17 17 17 17 8 8 7 7 6 6 6 6 6 6 6 6 6 6 6 6 6 6 6 6 6 6 6 6 1 1 1 1 1 1 1 1 1 1 1 1 1 1 1 1 1 1 1 1 1 1 1 1 1 1 1 1 1 1 1 1
symmnumber: 1
zpe: 1287517.4 jmol-1
zpe.correction: 0.490389 hartree
zpe.thermalcorrener: 0.522563 hartree
zpe.thermalcorrenthalpy: 0.523507 hartree
zpe.thermalcorrgfe: 0.421616 hartree
zpe.sumelectzpe: -2879.297645 hartree
zpe.sumelectthermal: -2879.265472 hartree
zpe.sumelectthermalent: -2879.264528 hartree
zpe.sumelectthermalfe: -2879.366419 hartree
dipole: -0.0424 -2.7550 0.0155
dipole: 2.7554
quadrupole: -241.7149 -224.7894 -186.2243
quadrupole: -0.4529 -17.1832 0.5486
quadrupole: -24.1387 -7.2133 31.3519 -0.4529 -17.1832 0.5486
hfenergy: -2879.7880348 hartree
pointgroup: C01 [X(C20H32Cl4N2O2)]
dipole: 0.0165953 1.0839032 -0.0072532 debye
polarizability: 355.1394078|-0.446669|249.2019422|-8.8949794|-1.0380274|247.1891112 unknown
InChI: InChI=1S/C20H32Cl4N2O2/c1-13(21)7-25(8-14(2)22)11-17-5-20(28)18(6-19(17)27)12-26(9-15(3)23)10-16(4)24/h5-6,13-16,27-28H,7-12H2,1-4H3
charge 0 multiplicity 1
60 atoms
Cl -7.343064 1.897406 0.155291
Cl -3.182424 -3.86771 1.105349
Cl 7.331256 1.912807 -0.188284
Cl 3.197242 -3.88114 -1.069274
O  -0.373048 1.307849 2.78545
O  0.364616 1.379802 -2.803391
N  -3.576658 0.237857 0.661901
N  3.570315 0.230697 -0.659835
C  -2.722697 1.360989 1.160323
C  2.713303 1.341544 -1.179172
C  -5.02599 0.512052 0.849414
C  -3.149883 -1.085171 1.194107
C  5.0187 0.506857 -0.854245
C  3.147309 -1.100549 -1.175078
C  -1.322609 1.343255 0.564426
C  1.313419 1.332422 -0.582361
C  -0.166793 1.324395 1.386954
C  0.157756 1.359944 -1.405142
C  -5.590725 1.302157 -0.3488
C  -3.431659 -2.208095 0.176101
C  5.581916 1.320388 0.328818
C  3.449982 -2.214842 -0.153626
C  -1.134377 1.361887 -0.835221
C  1.125378 1.316339 0.81715
C  -5.707844 0.504533 -1.645381
C  -2.524577 -2.203296 -1.051572
C  5.703809 0.546462 1.639236
C  2.560594 -2.208966 1.086943
H  -3.223933 2.305698 0.874986
H  -2.650261 1.355815 2.268796
H  3.21244 2.293555 -0.914477
H  2.639503 1.314848 -2.287298
H  -5.224877 1.074367 1.789227
H  -5.574243 -0.444301 0.924383
H  -3.649304 -1.325445 2.159184
H  -2.063176 -1.053425 1.387999
H  5.21397 1.053133 -1.804176
H  5.570722 -0.448411 -0.913222
H  3.63569 -1.344354 -2.145086
H  2.057617 -1.07771 -1.353875
H  -5.040914 2.246361 -0.496607
H  -4.49837 -2.237824 -0.101679
H  5.028665 2.264933 0.46047
H  4.52056 -2.237159 0.109589
H  -2.027238 1.358458 -1.474635
H  2.018447 1.276911 1.454827
H  -4.705123 0.133333 -1.928596
H  -6.102991 1.127096 -2.465225
H  -6.378732 -0.362611 -1.512166
H  -2.629526 -1.230356 -1.565902
H  -2.791841 -3.011985 -1.751774
H  -1.467366 -2.32669 -0.758185
H  4.702974 0.175925 1.929882
H  6.096767 1.185269 2.447524
H  6.37834 -0.319995 1.520853
H  2.673096 -1.236001 1.599578
H  2.83863 -3.01696 1.783755
H  1.499231 -2.332973 0.80932
H  0.490032 1.268798 3.265792
H  -0.498634 1.369928 -3.284949
