program: Gaussian 09
title: 000220460
version: EM64L-G09RevD.01
frameworkgroup: C1[X(C17H29NO)]
method: RPBEPBE
basis: SDD
operation: Freq
keyword: #p
keyword: freq=noraman
keyword: PBEPBE/SDD
title: #p freq=noraman PBEPBE/SDD
converged: YES YES NO NO
title: Mulliken charges:
elementType: O N C C C C C C C C C C C C C C C C C H H H H H H H H H H H H H H H H H H H H H H H H H H H H H
charge: -0.441746 -0.103711 0.128628 -0.412379 0.301939 0.557963 -0.726432 -0.779033 -0.732619 -0.729038 -0.718488 -0.570515 -0.429849 0.314081 -0.434486 0.079130 -0.483230 -0.630433 -0.614452 0.186910 0.188842 0.214375 0.222472 0.207626 0.214906 0.217979 0.217314 0.210426 0.210020 0.210353 0.203738 0.204482 0.233875 0.197709 0.223692 0.226174 0.298553 0.227490 0.211747 0.224193 0.227577 0.353668 0.248000 0.189683 0.219479 0.187492 0.226167 0.219726
chargesum: 0.00000
title: Mulliken charges with hydrogens summed into heavy atoms:
elementType: O N C C C C C C C C C C C C C C C C C
charge: -0.088078 -0.103711 0.128628 -0.036627 0.301939 0.557963 -0.081959 -0.128834 -0.101819 -0.086943 -0.070912 -0.271962 -0.202359 0.314081 -0.222740 0.079130 -0.031460 0.026729 0.018932
polarizability: 2.27295000e+02 3.50797494e+00 1.96920354e+02 -1.51820362e+01 -1.38123793e+00 1.60430276e+02
1716.lowfreq: -13.7361 -6.5151 -3.0553 -0.0004 -0.0003 0.0004 16.7868 36.3534 44.1672
frequency: 15.8058 36.1909 44.0212 56.4929 70.5891 83.9857 120.3841 168.2335 184.6083 199.8194 213.7205 220.4790 233.4470 235.5236 243.5145 247.3616 251.8573 262.6396 277.7167 287.3269 302.4046 319.4687 334.1948 343.9307 347.7564 355.2335 363.4757 378.4442 406.2616 410.0276 427.1963 441.4221 468.1109 491.4331 518.1568 528.8765 595.4422 615.9129 657.0255 734.9958 736.4839 788.6044 800.2466 813.1676 825.1512 863.9501 895.0187 914.2697 918.4499 925.5647 928.6369 934.3391 940.7624 945.5924 975.1674 991.2628 1002.5851 1023.4932 1028.1287 1032.6283 1035.6801 1073.1984 1089.6984 1101.5350 1130.9436 1136.5490 1148.6641 1166.1885 1168.4913 1193.9797 1203.6240 1217.7767 1237.0153 1249.1748 1252.9838 1266.5130 1274.7938 1296.3863 1327.5966 1340.7016 1355.7401 1370.2067 1374.0392 1377.7420 1381.6625 1395.3351 1403.3101 1415.7261 1416.7258 1440.3851 1451.5167 1458.8295 1459.5748 1461.9814 1462.5405 1464.7490 1464.8870 1471.2818 1475.2185 1477.3807 1480.0241 1480.4915 1486.4006 1487.4469 1493.9472 1496.3233 1500.5413 1606.8535 1614.6600 2848.9781 2862.0691 2892.8036 2950.9658 2960.4777 2968.3749 2970.1320 2975.6853 2980.1552 2991.8989 3005.8958 3015.1234 3024.1879 3052.7293 3057.8935 3059.7536 3063.8680 3066.3524 3067.8021 3074.5066 3074.9292 3083.6788 3084.1222 3085.3922 3100.0016 3101.6798 3135.7007 3152.5481 3580.7640
redmass: 3.5235 2.7484 2.8755 3.7449 2.8837 3.5678 3.6573 2.4367 1.7410 2.5679 1.4505 1.4264 1.1289 1.1356 1.8613 2.1072 2.3564 2.0333 1.1102 1.7273 2.6097 3.0058 1.9858 1.1792 1.6178 1.7962 2.0757 2.3311 1.9182 2.4963 2.8142 3.0394 2.5563 2.8655 3.4283 3.1289 4.4808 3.0911 5.1050 3.5776 3.6740 5.7311 1.5036 3.1776 3.7987 2.0099 2.5616 1.7060 1.9736 1.5318 1.4669 1.5726 1.2330 1.5573 1.7881 1.6601 1.3069 1.4052 2.2758 1.4152 1.5402 2.1582 1.2632 1.9173 2.3338 1.4033 1.5745 1.2673 1.6965 2.7061 1.9539 2.9880 2.3246 3.0257 2.3822 2.9914 1.8070 1.4751 1.5783 1.3379 1.6344 1.2027 1.2020 1.2081 4.8082 1.2526 1.2100 2.1520 1.2962 1.2138 1.0703 1.0494 1.0563 1.0503 1.0689 1.0566 1.0680 1.0631 1.0792 1.0574 1.0557 1.0618 1.0546 1.0758 2.1398 1.1320 1.0584 6.5138 6.7609 1.0568 1.0572 1.0682 1.0586 1.0352 1.0347 1.0371 1.0381 1.0364 1.0884 1.0992 1.0720 1.0729 1.0994 1.0990 1.0994 1.1000 1.0978 1.0990 1.1010 1.0996 1.0990 1.1007 1.0989 1.0949 1.0878 1.0941 1.0897 1.0659
irintensity: 0.0433 0.1470 0.0888 0.1209 1.5705 0.9144 0.0584 0.8361 0.7695 1.8353 0.2504 1.4570 0.5855 1.0860 3.5163 2.1260 1.1183 1.9685 0.0305 0.9842 0.6002 3.5222 1.2895 92.6035 8.5282 25.9668 0.3158 0.6914 0.2877 2.5766 0.5703 6.3055 0.4765 1.4040 13.6246 0.5328 4.4772 13.4597 7.2674 0.9385 3.5668 22.7853 40.5067 12.6114 4.5149 0.5204 1.0541 3.3688 8.7091 4.8860 1.0843 4.4303 0.4181 1.5382 6.6290 10.2920 2.3348 0.6685 50.7293 0.4128 18.1855 75.9419 7.4613 69.8477 11.4180 5.9695 14.6267 38.6851 3.5187 0.7696 3.0518 14.1673 7.2138 31.2660 97.5939 25.0369 7.6670 30.6924 5.3229 6.6502 10.0107 7.1773 28.9972 17.0216 19.1598 15.8638 13.2439 9.6594 5.6328 7.6028 2.4915 16.9730 1.3449 0.6640 3.9098 0.9708 1.1646 11.2814 26.4045 8.5295 19.6761 11.1940 9.9516 22.4404 51.4934 40.2731 13.9379 1.8529 8.0712 86.0636 185.6489 81.2425 28.5633 43.2664 42.3246 44.5974 24.7814 26.1005 21.4139 26.3677 39.5465 35.3257 4.6675 50.5665 5.7819 11.8664 96.2528 101.0242 25.2875 53.2924 35.5736 45.8995 28.7038 35.6332 22.6631 21.6580 2.9510 28.8775
temp: 298.150 k
press: 1.00000 atm
elementType: 8 7 6 6 6 6 6 6 6 6 6 6 6 6 6 6 6 6 6 1 1 1 1 1 1 1 1 1 1 1 1 1 1 1 1 1 1 1 1 1 1 1 1 1 1 1 1 1
symmnumber: 1
zpe: 1107756.8 jmol-1
zpe.correction: 0.421922 hartree
zpe.thermalcorrener: 0.444284 hartree
zpe.thermalcorrenthalpy: 0.445228 hartree
zpe.thermalcorrgfe: 0.371254 hartree
zpe.sumelectzpe: -793.647735 hartree
zpe.sumelectthermal: -793.625374 hartree
zpe.sumelectthermalent: -793.624430 hartree
zpe.sumelectthermalfe: -793.698403 hartree
dipole: 0.1259 1.0492 0.4850
dipole: 1.1627
quadrupole: -116.6752 -107.3304 -120.4323
quadrupole: -0.5908 -1.3301 0.6536
quadrupole: -1.8625 7.4822 -5.6197 -0.5908 -1.3301 0.6536
hfenergy: -794.0696574 hartree
pointgroup: C01 [X(C17H29N1O1)]
dipole: 0.0284993 -0.3792854 -0.2541243 debye
polarizability: 227.2187139|-7.1180694|197.0126131|13.4471622|3.8654703|160.414303 unknown
InChI: InChI=1S/C17H29NO/c1-16(2,3)12-17(4,5)14-8-9-15(19)13(10-14)11-18(6)7/h8-10,19H,11-12H2,1-7H3
charge 0 multiplicity 1
48 atoms
O  2.78823 -2.957198 0.100593
N  3.425271 1.214577 0.487459
C  -1.569735 0.70117 -1.113285
C  -2.9548 0.216926 -0.54202
C  -3.323712 0.268778 0.98499
C  -0.417353 -0.275221 -0.76264
C  -1.718562 0.699928 -2.672249
C  -1.245579 2.158165 -0.695502
C  -4.567186 -0.653463 1.160513
C  -3.737634 1.698071 1.436687
C  -2.193089 -0.257587 1.906853
C  0.801385 0.158445 -0.18417
C  -0.532943 -1.6573 -1.069772
C  1.874118 -0.718502 0.098923
C  0.514598 -2.559341 -0.795714
C  1.712621 -2.091198 -0.208389
C  3.157496 -0.219584 0.755502
C  3.852672 1.45631 -0.906253
C  4.362685 1.803772 1.462885
H  -3.739488 0.79284 -1.078344
H  -3.085226 -0.83487 -0.869163
H  -2.019078 -0.294407 -3.050175
H  -0.760109 0.969124 -3.152762
H  -2.485577 1.431761 -2.989979
H  -0.377075 2.543401 -1.261768
H  -2.107777 2.813573 -0.91515
H  -1.012132 2.251299 0.378864
H  -4.314774 -1.706634 0.932884
H  -5.390017 -0.346525 0.486052
H  -4.945802 -0.610292 2.199493
H  -4.551793 2.094131 0.799386
H  -4.107666 1.673411 2.479801
H  -2.898294 2.411337 1.398569
H  -2.547545 -0.290509 2.955459
H  -1.878044 -1.276462 1.61771
H  -1.297541 0.386424 1.871447
H  0.970255 1.210202 0.066235
H  -1.447554 -2.046394 -1.531638
H  0.399367 -3.624562 -1.038937
H  3.066864 -0.34334 1.853722
H  4.005839 -0.874683 0.442352
H  2.58034 -3.879902 -0.188901
H  3.098097 1.05244 -1.602675
H  4.836629 0.979846 -1.148861
H  3.942259 2.542923 -1.085357
H  5.386401 1.34995 1.430267
H  3.966083 1.678173 2.486388
H  4.468168 2.886302 1.266971
