program: Gaussian 09
title: 000220433
version: EM64L-G09RevD.01
frameworkgroup: C1[X(C12H18N2O3S)]
method: RPBEPBE
basis: SDD
operation: Freq
keyword: #p
keyword: freq=noraman
keyword: PBEPBE/SDD
title: #p freq=noraman PBEPBE/SDD
converged: YES YES NO NO
title: Mulliken charges:
elementType: S O O O N N C C C C C C C C C C C C H H H H H H H H H H H H H H H H H H
charge: 0.897098 -0.288291 -0.545646 -0.549935 -0.464395 -0.688773 0.012436 -0.405670 -0.418871 -0.376667 -0.467563 -0.303023 -0.041312 -0.240308 -0.197879 -0.388233 -0.389686 0.512954 0.182804 0.244879 0.214002 0.224800 0.187449 0.195440 0.218877 0.251290 0.265824 0.178415 0.216565 0.325140 0.286141 0.268441 0.229048 0.228319 0.313116 0.313212
chargesum: 0.00000
title: Mulliken charges with hydrogens summed into heavy atoms:
elementType: S O O O N N C C C C C C C C C C C C
charge: 0.897098 -0.288291 -0.545646 -0.549935 -0.139254 -0.062445 0.195241 0.053210 -0.006621 0.037650 0.049552 0.091956 -0.041312 0.045833 0.070562 -0.159185 -0.161367 0.512954
polarizability: 2.60598379e+02 -1.06168596e+01 1.62070313e+02 1.31757459e+01 1.04210643e+01 1.29784843e+02
1716.lowfreq: -29.8700 -6.2388 -0.7901 -0.0018 -0.0017 -0.0008 11.8417 27.9204 40.1083
frequency: -19.6318 27.8831 39.9543 48.2564 78.9673 102.8838 131.8023 151.9968 180.3729 226.0542 227.5979 238.9265 269.4468 293.5204 306.8176 323.6919 354.1418 356.6930 405.2317 405.8222 412.1972 413.1880 419.2973 430.5751 440.9437 483.9945 522.8313 532.6558 608.8811 614.0416 623.7787 719.7655 774.7639 789.0390 806.7592 811.5897 812.8906 831.8322 834.6043 837.1285 850.0917 903.6854 914.5069 947.2115 947.6692 957.2327 968.6403 983.2587 1006.2031 1021.5830 1024.5283 1054.5595 1055.5355 1088.4091 1100.8836 1123.0570 1129.7982 1162.4396 1182.8207 1184.0998 1229.3093 1251.1613 1258.8879 1286.8362 1298.8227 1312.7745 1320.2511 1324.3487 1337.1264 1344.3670 1355.6524 1373.4876 1376.7657 1399.3142 1427.7502 1433.3422 1448.4621 1458.7117 1461.0882 1472.8720 1489.9517 1587.4620 1615.5362 1648.5772 2911.9315 2933.0847 2964.6778 2985.5639 2987.1549 2995.9549 3041.7819 3048.4157 3053.7998 3056.9992 3071.0911 3133.3412 3135.6216 3161.6009 3167.2048 3335.0344 3564.1652 3703.3434
redmass: 4.7024 3.7694 5.8513 4.3971 4.0181 4.6312 4.5972 6.4260 6.6182 2.5150 6.2889 5.3631 3.2468 5.5042 2.3857 3.4944 2.8936 3.9462 1.1398 2.5199 3.0161 2.9092 1.6436 3.1492 3.2901 5.9394 2.6606 1.9192 4.7751 3.6167 6.8821 2.9510 2.4361 10.1944 2.4233 4.0412 1.3013 2.1635 1.7690 1.8747 2.3393 1.9402 4.7534 1.6528 1.8353 2.0423 1.3393 4.7177 1.8247 1.5164 2.4164 2.2375 2.5384 2.4216 2.0544 2.1260 1.1952 1.2139 1.1690 1.3915 1.3269 1.2130 1.2927 1.2251 1.2970 1.2732 2.5407 1.2795 1.3651 1.4230 1.2858 1.3992 1.3166 5.5512 1.0773 3.6310 1.0913 1.0876 1.0868 1.0930 2.9519 7.4120 4.7802 1.2271 1.0828 1.0686 1.0655 1.0610 1.0605 1.0603 1.0958 1.1021 1.1023 1.1023 1.0968 1.0892 1.0889 1.0954 1.0962 1.0736 1.0452 1.1040
irintensity: 2.9669 0.4422 1.4194 3.3230 2.2924 1.5573 0.2164 1.5026 1.4576 3.6733 6.3575 23.4619 6.2382 7.3524 14.4422 3.6638 15.8727 9.4794 15.4739 3.4382 6.8761 3.4356 142.3105 194.3330 1.9750 113.1200 35.6542 22.3615 32.9980 13.8241 1.6397 0.7100 1.7410 76.8478 21.6377 76.5573 4.9876 109.6804 67.4967 40.5973 12.1806 12.6825 46.7575 0.5921 2.4828 69.9390 0.3978 2.8484 5.6350 18.6411 68.1264 1.8715 62.6117 13.3654 18.1148 14.9306 14.0891 9.7992 56.7654 8.3452 14.7395 6.2632 6.4542 4.3946 4.6838 5.8776 75.6211 4.7199 1.1955 1.9495 14.6478 18.1585 3.9091 5.1489 21.1697 0.8131 9.6437 6.1858 15.5441 8.9326 82.7930 6.9050 155.1467 268.4939 56.1406 97.3135 54.2855 5.6336 38.2014 25.6204 38.2917 49.2339 4.8841 36.7692 41.1331 14.2354 15.2757 7.4647 7.4509 53.2538 109.0657 24.7936
temp: 298.150 k
press: 1.00000 atm
elementType: 16 8 8 8 7 7 6 6 6 6 6 6 6 6 6 6 6 6 1 1 1 1 1 1 1 1 1 1 1 1 1 1 1 1 1 1
symmnumber: 1
zpe: 761187.8 jmol-1
zpe.correction: 0.289921 hartree
zpe.thermalcorrener: 0.307435 hartree
zpe.thermalcorrenthalpy: 0.308379 hartree
zpe.thermalcorrgfe: 0.244206 hartree
zpe.sumelectzpe: -1199.754028 hartree
zpe.sumelectthermal: -1199.736514 hartree
zpe.sumelectthermalent: -1199.735570 hartree
zpe.sumelectthermalfe: -1199.799743 hartree
dipole: 3.4803 -1.3541 3.3016
dipole: 4.9846
quadrupole: -58.1727 -110.7473 -126.8824
quadrupole: -6.0893 6.2763 4.7704
quadrupole: 40.4281 -12.1465 -28.2816 -6.0893 6.2763 4.7704
hfenergy: -1200.0439489 hartree
pointgroup: C01 [X(C12H18N2O3S1)]
dipole: -1.3498698 1.3448096 -0.4639868 debye
polarizability: 259.9471313|-15.0845303|128.6639342|11.6340239|7.5887814|163.8424696 unknown
InChI: InChI=1S/C12H18N2O3S/c13-10-4-6-12(7-5-10)18(15,16)14-9-11-3-1-2-8-17-11/h4-7,11,14H,1-3,8-9,13H2
charge 0 multiplicity 1
36 atoms
S  -0.214375 -0.611895 0.46304
O  3.240828 1.650706 -0.103217
O  -0.110958 -1.304548 1.938811
O  0.306893 -1.407693 -0.872358
N  0.628821 1.061629 0.670336
N  -5.968438 0.942345 -0.609132
C  3.128736 0.743608 1.066673
C  3.371204 -0.72322 0.655601
C  4.745628 -0.868035 -0.042371
C  4.839837 0.107396 -1.239573
C  1.738706 1.049584 1.658675
C  4.551504 1.545365 -0.771798
C  -1.977469 -0.109644 0.136576
C  -2.485953 -0.272862 -1.164102
C  -2.754874 0.385761 1.199452
C  -3.824243 0.078962 -1.412411
C  -4.091381 0.736653 0.947094
C  -4.645619 0.592948 -0.363218
H  3.899632 1.039348 1.817565
H  2.573389 -1.059479 -0.034533
H  3.317521 -1.3645 1.556203
H  4.892153 -1.91061 -0.378923
H  5.558983 -0.643053 0.679744
H  5.844196 0.068713 -1.70518
H  4.100248 -0.180526 -2.011198
H  1.749047 2.063526 2.101434
H  1.485308 0.326546 2.457387
H  5.344936 1.883346 -0.067308
H  4.497681 2.254779 -1.614814
H  0.983583 1.32796 -0.272085
H  -1.846864 -0.685333 -1.951648
H  -2.3270 0.482863 2.201974
H  -4.24076 -0.045073 -2.418623
H  -4.714702 1.123038 1.761703
H  -6.561068 1.300505 0.134228
H  -6.372732 0.836287 -1.535103
