program: Gaussian 09
title: 000220424
version: EM64L-G09RevD.01
frameworkgroup: C1[X(C9H13NO)]
method: RPBEPBE
basis: SDD
operation: Freq
keyword: #p
keyword: freq=noraman
keyword: PBEPBE/SDD
title: #p freq=noraman PBEPBE/SDD
converged: YES YES NO NO
title: Mulliken charges:
elementType: O N C C C C C C C C C H H H H H H H H H H H H H
charge: -0.438241 -0.697565 -0.560160 -0.399231 0.521169 -0.313843 -0.395212 -0.407461 -0.412563 -0.411298 0.480332 0.199936 0.203573 0.229974 0.198951 0.214343 0.180981 0.226155 0.224191 0.212056 0.211529 0.328816 0.301603 0.301966
chargesum: 0.00000
title: Mulliken charges with hydrogens summed into heavy atoms:
elementType: O N C C C C C C C C C
charge: -0.109426 -0.093996 -0.156651 0.029695 0.521169 0.081481 -0.169057 -0.183270 -0.200507 -0.199769 0.480332
polarizability: 1.53551336e+02 -3.58976182e-01 1.02570116e+02 -1.54636780e+01 -1.94818897e+00 6.95869648e+01
1716.lowfreq: -11.5661 -4.9572 -0.0008 -0.0007 -0.0005 13.4509 30.1158 56.7859 72.9340
frequency: 27.9095 56.7439 72.9255 115.8022 159.2641 238.2355 291.6895 310.3627 317.3939 334.9991 357.5557 391.9604 409.1695 442.5270 496.3360 543.7053 639.6296 725.3679 762.2225 767.9492 815.6822 822.0700 833.2236 854.3632 933.2344 951.2722 958.2060 1000.3367 1009.9367 1021.5264 1048.1895 1060.6644 1110.9160 1137.9310 1188.1916 1220.7044 1241.7320 1260.8108 1283.1079 1310.8518 1315.7299 1323.0642 1346.6394 1379.8266 1385.4521 1433.6409 1465.6989 1473.4634 1487.1921 1519.8589 1582.4984 1632.9525 1644.5286 2941.7939 2967.4726 2975.4281 3017.5308 3044.2288 3071.2749 3105.1921 3107.2461 3127.9821 3135.1239 3559.0381 3569.2339 3709.7042
redmass: 3.5338 5.2703 1.8158 2.7027 4.3450 4.1440 2.2957 1.4439 1.1990 3.1130 1.0453 2.5154 2.7020 4.0256 4.3893 2.5383 6.6090 3.3527 1.1045 3.9992 1.2654 2.0697 4.0413 1.2525 1.4080 1.3577 4.4645 2.8664 1.4813 3.7366 2.0127 2.0070 1.2139 1.1597 1.0949 2.3291 1.3702 1.3023 1.0877 2.7560 1.3983 1.2945 1.3798 1.2476 5.3177 3.2103 1.0782 1.0919 1.0964 3.1212 6.6436 1.7697 2.2116 1.0694 1.0606 1.0624 1.0983 1.0969 1.0990 1.0866 1.0865 1.0962 1.0971 1.0661 1.0448 1.1040
irintensity: 0.4032 0.6272 4.9379 4.0737 6.8998 0.5540 14.8434 108.0553 276.2509 102.1365 1.3419 1.6904 0.0240 9.4593 9.8584 19.4645 0.1957 0.1341 5.0312 2.2552 0.9021 64.6730 23.4552 4.0199 1.4620 0.1282 88.8338 0.6843 0.0887 3.7824 4.0370 22.4383 28.4594 20.6498 13.8540 0.0335 23.3555 1.4184 0.9867 52.9943 16.9351 4.9846 4.4075 28.0678 9.5245 0.3289 0.5648 0.5747 10.3907 141.2982 3.3624 3.8678 257.7567 66.6867 10.4050 72.4320 8.3202 21.3191 58.0150 3.3007 37.0729 53.7475 2.3389 7.9295 64.3606 19.3235
temp: 298.150 k
press: 1.00000 atm
elementType: 8 7 6 6 6 6 6 6 6 6 6 1 1 1 1 1 1 1 1 1 1 1 1 1
symmnumber: 1
zpe: 531420.0 jmol-1
zpe.correction: 0.202407 hartree
zpe.thermalcorrener: 0.214054 hartree
zpe.thermalcorrenthalpy: 0.214999 hartree
zpe.thermalcorrgfe: 0.163891 hartree
zpe.sumelectzpe: -479.888742 hartree
zpe.sumelectthermal: -479.877094 hartree
zpe.sumelectthermalent: -479.876150 hartree
zpe.sumelectthermalfe: -479.927258 hartree
dipole: 3.5977 1.2351 -0.3627
dipole: 3.8210
quadrupole: -64.4689 -59.5474 -68.8184
quadrupole: -6.5924 -7.2708 -2.8332
quadrupole: -0.1907 4.7309 -4.5402 -6.5924 -7.2708 -2.8332
hfenergy: -480.0911488 hartree
pointgroup: C01 [X(C9H13N1O1)]
dipole: 1.4152092 -0.4932919 0.1174551 debye
dipolederiv: -0.9152652 -0.1655798 0.1737319 -0.1987087 -0.2516541 -0.1186048 0.2913601 -0.1342663 -0.6072092 -1.5677668 -0.0168818 -0.1984716 -0.0152047 -0.0852145 0.0227648 -0.2478445 0.0216151 -0.8212745 -0.0048757 -0.0003848 0.0321685 0.0067556 0.1665753 0.0050736 0.1192761 0.0030485 0.1674992 -0.263509 -0.0192896 0.036366 -0.0003889 0.1371747 -0.0450774 -0.1246158 -0.0176954 -0.0064729 0.1514345 0.0011976 0.0314899 0.0016718 -0.2739828 -0.0081928 0.032268 -0.0070662 -0.1305779 0.6151972 0.0430052 -0.1667559 0.0771649 0.3274617 0.0360835 -0.092008 0.050132 0.5410225 0.0999509 0.1430594 0.091195 -0.0354177 0.1657814 -0.0016946 0.0777997 0.0611942 -0.1101829 0.106102 -0.1534154 0.0834867 0.0231198 0.1638911 0.0246734 0.083692 -0.0382722 -0.1162118 -0.3824586 -0.0919458 -0.0334442 0.3764066 0.0723059 0.1093643 -0.030706 -0.0192544 -0.2344935 -0.3780413 0.080639 -0.0237762 -0.38927 0.0663081 -0.0904655 -0.0613963 0.0398728 -0.2390378 1.5653153 0.0123096 0.3997318 0.0123306 -0.0619004 -0.0049452 0.4445869 -0.0040999 0.2582375 0.0087138 -0.0232043 -0.0347643 -0.0721656 -0.0840717 -0.1415666 -0.0316223 -0.0757665 -0.0170726 -0.0002201 0.0262204 -0.0398505 0.0702121 -0.0669448 0.1413851 -0.037065 0.077562 -0.0262626 0.0518365 -0.0472819 -0.0212365 -0.0345218 -0.0590595 -0.1085759 -0.0465724 -0.0807262 -0.0062464 0.0443564 0.0380776 -0.0075473 0.0083017 -0.0767265 0.1416436 -0.0305492 0.0951859 -0.0362423 0.036307 0.0261772 -0.0016311 0.0536836 -0.0627328 0.1248064 -0.0170096 0.0841249 -0.027816 -0.0210566 -0.021463 0.0232539 -0.054811 -0.1204788 -0.1764544 -0.0075359 -0.1196281 -0.1018833 0.0380613 0.1093186 -0.0364912 0.1043472 -0.0631132 0.0201919 -0.0329605 0.024026 0.1251503 0.0418877 -0.1059715 -0.0442637 -0.0987945 -0.0691286 -0.0352802 -0.0394762 -0.0400428 0.1213705 -0.0067394 -0.1082788 -0.0516174 -0.0996513 -0.0753565 -0.0343563 -0.0596228 -0.0387218 0.1494182 -0.0136689 0.1138763 -0.0448551 0.1061688 -0.0739507 0.0177359 -0.0535763 0.0217837 0.1536715 0.355428 0.152483 -0.0586429 0.1511398 0.1039859 0.1414477 -0.0320548 0.1167317 0.2203911 0.2197805 -0.0064067 -0.0543482 -0.0210655 0.1098951 -0.0149328 -0.0527465 -0.0123795 0.3718363 0.2192306 0.0137395 -0.0537274 0.0286971 0.1109358 -0.0050238 -0.0516207 -0.0073576 0.3723865 unknown
polarizability: 153.436476|-0.5835247|102.6839345|15.7661768|0.1174528|69.5880066 unknown
InChI: InChI=1S/C9H13NO/c10-9-5-3-8(4-6-9)2-1-7-11/h3-6,11H,1-2,7,10H2
charge 0 multiplicity 1
24 atoms
O  -4.792826 0.056246 0.995876
N  4.115605 0.003717 0.692102
C  -1.438815 -0.024781 -0.969213
C  -2.394897 0.009089 0.257209
C  0.029618 -0.017013 -0.570569
C  -3.876561 -0.010254 -0.156458
C  0.716235 1.197684 -0.313228
C  0.753633 -1.224178 -0.396144
C  2.06184 1.215193 0.103493
C  2.099935 -1.228914 0.020903
C  2.778846 -0.003629 0.280623
H  -1.663086 -0.928018 -1.571597
H  -1.664856 0.848315 -1.61368
H  -2.19721 0.915407 0.860446
H  -2.174838 -0.862181 0.909178
H  -4.12698 0.884664 -0.752022
H  -4.089622 -0.909405 -0.776535
H  0.18871 2.151355 -0.445203
H  0.255949 -2.182393 -0.594889
H  2.565787 2.172191 0.289296
H  2.633282 -2.180414 0.141451
H  -4.585953 -0.696423 1.605933
H  4.627449 -0.864538 0.814376
H  4.598854 0.87758 0.875553
