program: Gaussian 09
title: 000220421
version: EM64L-G09RevD.01
frameworkgroup: C1[X(C11H15NO2)]
method: RPBEPBE
basis: SDD
operation: Freq
keyword: #p
keyword: freq=noraman
keyword: PBEPBE/SDD
title: #p freq=noraman PBEPBE/SDD
converged: YES YES NO NO
title: Mulliken charges:
elementType: O O N C C C C C C C C C C C H H H H H H H H H H H H H H H
charge: -0.316856 -0.297502 -0.379943 0.045238 -0.515929 0.475805 -0.686737 -0.683399 -0.370012 -0.440809 0.303543 -0.222333 -0.216502 -0.241503 0.233143 0.265226 0.225791 0.207223 0.231450 0.220898 0.210201 0.254185 0.215723 0.321787 0.246385 0.231600 0.226850 0.226889 0.229588
chargesum: 0.00000
title: Mulliken charges with hydrogens summed into heavy atoms:
elementType: O O N C C C C C C C C C C C
charge: -0.316856 -0.297502 -0.058156 0.278381 -0.024912 0.475805 -0.027166 -0.003289 -0.123627 -0.209209 0.303543 0.004517 0.010386 -0.011915
polarizability: 1.81222441e+02 2.50896392e+00 1.23639928e+02 9.80091790e+00 1.79383688e+00 8.79502223e+01
1716.lowfreq: -8.1008 -1.9417 -0.0004 0.0005 0.0006 8.1737 22.8397 26.7638 39.8911
frequency: 22.3637 26.3411 39.7913 68.8298 86.3334 137.6812 186.1952 197.1447 227.7428 240.9575 249.8792 291.7418 347.8689 388.4578 404.2916 435.3107 459.9047 525.0602 565.6995 605.4455 616.9599 678.1460 699.8011 705.2228 748.3375 786.6512 816.2039 855.3263 884.4287 914.3112 925.0909 933.2468 942.3858 978.6618 990.1770 996.2186 1022.0603 1027.2658 1082.6106 1104.2600 1110.6193 1155.6567 1172.2821 1178.9557 1186.5840 1200.0360 1213.9915 1238.0192 1313.3220 1322.8504 1339.2108 1356.1066 1378.2327 1388.7461 1395.3508 1442.1555 1456.3150 1464.6560 1472.4331 1472.7381 1486.5320 1486.7623 1490.3878 1595.9759 1615.5996 1655.3870 2975.7306 2986.8652 2991.7286 3025.4945 3039.2018 3081.9152 3092.1934 3097.4243 3102.8691 3115.2544 3124.1078 3135.8577 3146.9108 3163.4364 3567.9742
redmass: 3.8260 3.8543 3.4975 5.1563 4.6184 3.7578 3.7560 1.0343 2.2767 4.0819 1.4399 3.2453 2.6752 3.3601 2.8099 2.5929 2.8216 3.5483 2.1812 1.5969 5.9774 6.0813 10.6723 1.9438 1.7667 3.3182 3.7303 1.2489 2.6380 1.4676 1.2309 2.7619 1.4169 1.3896 6.2267 1.3289 2.5069 2.1971 1.7319 1.8350 4.1322 2.0490 1.0538 1.9633 1.1394 1.8499 2.5391 1.2637 1.3485 1.4221 1.2939 1.5037 1.2662 4.6004 1.2351 2.1286 1.0536 1.0494 1.1924 1.0759 1.3912 1.8667 1.3145 6.0864 6.0402 9.2501 1.0638 1.0356 1.0358 1.0865 1.0973 1.0992 1.0988 1.1005 1.1005 1.0872 1.0861 1.0912 1.0962 1.1016 1.0773
irintensity: 0.1068 0.1521 1.1405 8.1964 0.1833 1.3524 2.5343 0.0266 7.9631 0.1104 4.8310 9.9652 0.8527 10.0820 0.4610 1.1162 6.8828 16.0438 42.3213 98.5922 2.1270 8.1030 22.9179 42.2684 43.3689 16.4975 13.2664 0.2411 6.8209 2.6660 2.5182 75.7173 5.4977 0.4184 0.1445 3.5774 40.2533 33.9137 5.1778 36.6160 265.0156 11.9137 0.0901 119.2926 0.3359 146.9302 4.1890 98.4177 17.7210 1.9334 4.8290 4.9159 34.1325 4.8590 23.3477 21.1677 5.6001 11.0374 37.4011 0.6008 151.0309 2.9953 207.8922 0.4843 7.1946 293.1071 46.7086 16.1908 24.2826 7.5777 7.7233 9.3050 59.3613 21.0511 31.8335 8.6875 0.6195 13.6433 41.6060 21.6267 31.8957
temp: 298.150 k
press: 1.00000 atm
elementType: 8 8 7 6 6 6 6 6 6 6 6 6 6 6 1 1 1 1 1 1 1 1 1 1 1 1 1 1 1
symmnumber: 1
zpe: 630732.7 jmol-1
zpe.correction: 0.240233 hartree
zpe.thermalcorrener: 0.254629 hartree
zpe.thermalcorrenthalpy: 0.255573 hartree
zpe.thermalcorrgfe: 0.196555 hartree
zpe.sumelectzpe: -632.333978 hartree
zpe.sumelectthermal: -632.319582 hartree
zpe.sumelectthermalent: -632.318638 hartree
zpe.sumelectthermalfe: -632.377656 hartree
dipole: -0.4398 0.4730 -2.1143
dipole: 2.2108
quadrupole: -69.6605 -77.8020 -90.5743
quadrupole: 3.4217 -0.7532 3.1007
quadrupole: 9.6851 1.5436 -11.2287 3.4217 -0.7532 3.1007
hfenergy: -632.574211 hartree
pointgroup: C01 [X(C11H15N1O2)]
dipole: -0.1689385 -0.3320362 0.7859708 debye
polarizability: 179.7922242|-5.0635716|122.0316657|-13.0779523|9.6313983|90.9887012 unknown
InChI: InChI=1S/C11H15NO2/c1-9(2)14-11(13)12-8-10-6-4-3-5-7-10/h3-7,9,12H,8H2,1-2H3
charge 0 multiplicity 1
29 atoms
O  2.530644 -0.227396 0.608973
O  1.772597 0.883184 -1.337855
N  0.44026 0.657981 0.587072
C  3.834137 -0.535059 -0.074163
C  -0.723417 1.389569 0.070769
C  -2.024873 0.598703 0.176269
C  4.846559 -0.716519 1.059306
C  3.660875 -1.777535 -0.959859
C  -2.083174 -0.760667 -0.224301
C  -3.203977 1.224193 0.650182
C  1.586241 0.47992 -0.157908
C  -3.297826 -1.477102 -0.156061
C  -4.422823 0.510259 0.716303
C  -4.473167 -0.843546 0.313508
H  4.085028 0.340727 -0.701481
H  -0.488692 1.620793 -0.985487
H  -0.833889 2.358362 0.597899
H  5.847697 -0.923617 0.639808
H  4.907884 0.193665 1.679986
H  4.558683 -1.563058 1.707619
H  4.620574 -2.031991 -1.446596
H  2.914567 -1.589058 -1.749807
H  3.337888 -2.643289 -0.354343
H  0.4237 0.277488 1.534068
H  -1.173047 -1.252129 -0.58779
H  -3.169702 2.27367 0.969378
H  -3.330403 -2.526407 -0.470732
H  -5.327256 1.007012 1.085269
H  -5.415688 -1.399853 0.366572
