program: Gaussian 09
title: 000220416
version: EM64L-G09RevD.01
frameworkgroup: C1[X(C11H13NO)]
method: RPBEPBE
basis: SDD
operation: Freq
keyword: #p
keyword: freq=noraman
keyword: PBEPBE/SDD
title: #p freq=noraman PBEPBE/SDD
converged: YES YES NO NO
title: Mulliken charges:
elementType: O N C C C C C C C C C C C H H H H H H H H H H H H H
charge: -0.298656 -0.656071 -0.500317 0.491589 0.310755 -0.486432 0.105289 -0.680037 -0.355602 -0.375079 -0.246585 -0.231002 -0.236028 0.182022 0.279804 0.201862 0.201135 0.270658 0.218976 0.219606 0.278186 0.223221 0.226905 0.227502 0.313838 0.314461
chargesum: 0.00000
title: Mulliken charges with hydrogens summed into heavy atoms:
elementType: O N C C C C C C C C C C C
charge: -0.298656 -0.027771 -0.038492 0.491589 0.310755 -0.284570 0.105289 0.010732 -0.135995 -0.096893 -0.023364 -0.004097 -0.008526
polarizability: 2.17838580e+02 1.10700770e+01 1.35079398e+02 -3.35375565e+00 2.28849279e+00 6.45890553e+01
1716.lowfreq: -10.4684 -3.0337 0.0004 0.0005 0.0007 9.9276 27.1708 43.3885 85.4775
frequency: 27.1206 43.3133 85.4502 125.0830 140.0788 192.4692 201.0604 223.5296 286.9333 298.2777 383.5731 402.0367 429.8557 449.6289 458.6988 496.5946 529.2203 615.1131 644.2185 663.8593 688.0055 700.0251 782.9865 790.2252 804.7323 840.9397 854.6865 857.2936 936.7210 983.4957 986.8563 990.7408 1005.2527 1021.0397 1033.9116 1066.9142 1074.0130 1082.1924 1118.3093 1170.0463 1188.0079 1209.3566 1247.7104 1309.3139 1313.9977 1366.2449 1379.2246 1383.4353 1418.3320 1429.0144 1454.0827 1470.9630 1478.2642 1488.3496 1515.2479 1589.2259 1607.2089 1610.4843 1644.1024 2975.6884 2986.2846 3072.8546 3089.3260 3107.6888 3116.9112 3122.2292 3132.5748 3146.3620 3155.5425 3165.7448 3532.9498 3675.9514
redmass: 3.4752 4.4634 3.3361 3.7581 4.9212 2.1043 2.0835 1.8372 3.2809 5.2034 4.4666 2.8002 4.2749 1.1427 2.6979 3.3641 1.1623 6.4163 3.1199 5.8572 3.8908 1.4789 1.3104 1.8676 2.5036 1.8572 2.8668 1.6089 1.4650 1.3953 3.1697 4.2496 1.3475 2.5111 1.8599 1.7535 1.5360 1.5789 1.6939 1.0650 1.1293 2.3320 1.2910 1.3443 1.3139 2.2727 1.4599 8.5239 1.8070 2.2288 1.2888 1.1003 2.0919 1.0834 5.2651 6.1393 5.3168 4.6173 1.2759 1.0651 1.0366 1.0973 1.0967 1.1005 1.0885 1.0848 1.0880 1.0922 1.0951 1.1005 1.0452 1.1035
irintensity: 0.2289 4.1842 1.8061 2.5119 1.2976 0.5855 1.2240 0.5518 2.9998 6.2554 2.8396 0.1251 2.2929 142.7440 2.9983 4.1813 119.2481 0.5302 1.6998 26.9409 1.9373 74.1053 6.4550 53.1585 13.2952 35.7595 30.9505 18.2050 2.9371 1.9267 5.0006 7.3656 2.8178 11.7312 1.2210 31.8432 8.2287 44.4047 2.5370 5.7003 17.1597 164.0075 10.5153 1.3504 2.1383 14.5178 22.5069 4.4742 31.5957 4.5155 63.0635 5.8928 2.3302 19.0914 186.1077 52.0610 226.3055 287.5568 333.6698 66.1615 50.0914 20.1372 14.1319 23.5778 14.7967 1.9306 6.9465 32.8333 24.9141 25.9399 88.8420 19.8235
temp: 298.150 k
press: 1.00000 atm
elementType: 8 7 6 6 6 6 6 6 6 6 6 6 6 1 1 1 1 1 1 1 1 1 1 1 1 1
symmnumber: 1
zpe: 561450.4 jmol-1
zpe.correction: 0.213845 hartree
zpe.thermalcorrener: 0.226523 hartree
zpe.thermalcorrenthalpy: 0.227467 hartree
zpe.thermalcorrgfe: 0.173887 hartree
zpe.sumelectzpe: -555.994964 hartree
zpe.sumelectthermal: -555.982286 hartree
zpe.sumelectthermalent: -555.981342 hartree
zpe.sumelectthermalfe: -556.034922 hartree
dipole: 2.5244 4.2186 0.7674
dipole: 4.9757
quadrupole: -54.3504 -69.5464 -82.7537
quadrupole: 8.4387 -0.5391 0.1868
quadrupole: 14.5331 -0.6629 -13.8702 8.4387 -0.5391 0.1868
hfenergy: -556.2088089 hartree
pointgroup: C01 [X(C11H13N1O1)]
dipole: 1.0430544 1.6157366 0.3655654 debye
dipolederiv: -0.8277414 0.1706658 0.0571727 -0.1954071 -0.9443658 -0.1683991 -0.057401 -0.1747255 -0.3845587 -1.105168 -0.4223368 -0.1302616 -0.9716083 -0.8505114 0.0798554 -0.3412479 0.002785 -0.584151 0.1006278 0.0916182 -0.0571049 0.1530738 -0.1270374 -0.0346008 -0.2226023 -0.0296675 0.0494126 1.9378875 0.5955118 0.0658146 0.5772734 0.7422163 0.1010056 0.0809101 0.171756 0.1044465 -0.5139007 0.0572199 0.04961 0.0935861 -0.0533746 -0.0216639 0.0697336 -0.0051059 -0.0071325 -1.7365952 -0.5985199 -0.1078692 -0.3437638 -0.3136458 0.0710096 0.0566119 0.0969234 -0.3052894 1.9575003 0.0898063 -0.0693915 0.6386511 0.989838 0.2119459 0.1015446 0.214797 0.2098623 -0.0295157 0.0060556 0.0328572 -0.010373 0.0710723 0.0462058 0.1418401 0.0015787 0.0315156 -0.0160124 0.0645216 -0.0245711 -0.0690504 0.0081832 -0.0051756 -0.0677994 -0.01342 -0.1359474 -0.0117611 -0.0945488 -0.0133656 0.0753287 0.0243015 -0.0050047 0.0215835 0.0225769 -0.125246 -0.1385187 -0.0848778 -0.0029809 -0.1524989 0.0953361 0.014886 0.00358 0.0137746 -0.1637058 -0.0505242 0.1514378 -0.0104045 0.1991047 0.0587774 -0.0127289 -0.0063478 -0.0110919 -0.1594653 0.0669404 -0.0273491 -0.0291141 -0.0140775 -0.0148763 0.0036305 -0.0209208 0.0046269 -0.1526522 -0.1634307 -0.0467664 0.1359061 -0.0991446 0.0001436 0.0926835 0.1054442 0.0453998 0.0171482 0.1038432 -0.0353183 -0.0970678 0.0146987 0.0630818 -0.0378048 -0.0539268 -0.0035996 0.0265573 0.0509229 0.0556366 0.0372943 0.0525163 -0.0813389 -0.1002039 0.0270853 -0.1070662 0.1369774 0.0028771 -0.0248567 -0.1119652 -0.0948871 0.0160077 -0.0918848 -0.1168406 -0.0301743 -0.0591368 0.0144436 -0.0975346 0.0884085 -0.0656556 0.079525 0.0381521 0.0893687 0.0085522 0.0458316 -0.0265287 0.1296901 0.0296862 0.1830739 -0.0812945 -0.0482347 0.0261308 -0.0585263 0.04592 0.0396299 -0.1132845 0.0141275 -0.1233641 -0.0333119 0.0131268 0.0134098 0.0060776 0.1395626 0.1565479 0.0731999 0.0009197 0.0347055 0.0026409 -0.0006995 -0.0192536 -0.0170592 0.1536275 0.0256677 0.0701352 0.0135175 0.1085172 -0.102922 -0.0114947 0.0154646 -0.007848 0.1566616 -0.0260364 -0.1017963 0.0148651 -0.12479 -0.0514521 0.0080047 0.0153227 0.007996 0.1547203 -0.1477022 0.0262397 0.0307311 0.0302502 0.0886821 -0.0033874 0.0265552 -0.0051946 0.1564718 0.1252088 0.0281185 0.0475183 0.1037226 0.1930039 -0.076902 0.0754723 -0.0752134 0.3322134 0.2113381 0.0373321 0.0356676 0.0001182 0.2213211 -0.0623211 0.0362828 -0.0581517 0.3163564 unknown
polarizability: 217.9448899|9.5880864|134.0839145|-7.8169761|6.2432875|65.4782298 unknown
InChI: InChI=1S/C11H13NO/c1-2-10(12)8-11(13)9-6-4-3-5-7-9/h3-8H,2,12H2,1H3
charge 0 multiplicity 1
26 atoms
O  0.66392 -1.506287 -0.599948
N  3.414831 1.80418 0.055157
C  3.367012 -0.502127 -0.752588
C  2.615829 0.710744 -0.230965
C  -1.17938 -0.042859 -0.083274
C  1.240254 0.769816 -0.013178
C  0.302728 -0.318729 -0.256586
C  3.734608 -1.487946 0.389416
C  -1.742304 1.259596 -0.003143
C  -2.049818 -1.164155 -0.02573
C  -3.136947 1.433281 0.138639
C  -3.440878 -0.993435 0.122893
C  -3.990959 0.308301 0.207866
H  4.28572 -0.165856 -1.275752
H  2.722998 -1.037919 -1.467646
H  0.836512 1.709087 0.383848
H  4.326154 -0.994674 1.182714
H  2.811784 -1.898732 0.830297
H  4.326419 -2.329409 -0.013268
H  -1.104538 2.14675 -0.07727
H  -1.600264 -2.159231 -0.10812
H  -3.557752 2.444028 0.18956
H  -4.09735 -1.869578 0.171523
H  -5.0726 0.444639 0.32078
H  3.022513 2.658872 0.446454
H  4.415102 1.773843 -0.127983
