program: Gaussian 09
title: 000220412
version: EM64L-G09RevD.01
frameworkgroup: C1[X(C12H14N2O3)]
method: RPBEPBE
basis: SDD
operation: Freq
keyword: #p
keyword: freq=noraman
keyword: PBEPBE/SDD
title: #p freq=noraman PBEPBE/SDD
converged: YES YES NO NO
title: Mulliken charges:
elementType: O O O N N C C C C C C C C C C C C H H H H H H H H H H H H H H
charge: -0.286006 -0.241620 -0.200953 0.054409 -0.436410 -0.441192 -0.555574 -0.475784 0.136457 -0.080379 0.362448 -0.409436 0.097634 0.223688 -0.802032 0.255509 -0.745366 0.224123 0.231041 0.240052 0.216032 0.242204 0.239585 0.321507 0.327716 0.236642 0.272191 0.241746 0.254589 0.244391 0.252787
chargesum: 0.00000
title: Mulliken charges with hydrogens summed into heavy atoms:
elementType: O O O N N C C C C C C C C C C C C
charge: -0.286006 -0.241620 -0.200953 0.054409 -0.108694 0.013972 -0.099489 0.006005 0.136457 -0.080379 0.362448 -0.087929 0.097634 0.223688 -0.051452 0.255509 0.006401
polarizability: 1.96883489e+02 -6.40820480e-01 1.79238149e+02 5.26973561e+00 5.07109233e+00 9.51001436e+01
1716.lowfreq: -74.4780 -8.9970 -5.3504 0.0003 0.0005 0.0006 2.8612 26.9302 54.5947
frequency: -74.4631 26.8890 54.5796 57.6372 67.1936 77.4650 81.9368 122.4089 130.2214 151.2297 220.9962 239.5809 250.8408 271.7442 314.0169 326.1842 351.3268 479.7185 498.5782 537.0385 543.2717 549.5206 568.1149 573.6601 596.3695 632.4052 652.2675 674.3946 733.6495 745.7341 760.8511 818.9848 836.8637 887.3622 904.2635 911.5124 919.1491 954.6461 979.3708 992.7883 1025.6700 1032.3152 1036.1377 1040.4593 1041.8792 1108.1661 1132.5132 1161.8983 1181.4878 1187.4281 1206.7650 1230.4415 1275.5187 1278.9960 1308.4944 1337.3010 1358.1428 1376.7793 1382.4739 1390.2514 1424.9450 1445.4710 1452.3322 1453.4318 1457.3567 1461.5016 1467.1752 1477.7520 1483.6872 1580.1285 1592.2299 1641.5784 1688.5728 2958.1670 2988.1601 2992.5437 3002.4178 3008.6438 3018.8812 3066.7271 3073.0616 3086.0467 3099.2523 3137.3984 3143.7046 3218.5939 3528.2290
redmass: 1.0389 6.0264 1.9101 5.0822 4.2693 2.2651 2.0294 4.5465 2.3579 2.8769 3.1633 6.9185 4.5452 3.9593 3.8144 4.7412 5.1273 4.4660 5.0453 3.6439 3.8594 3.0867 4.8252 3.6098 4.0563 1.7011 2.1998 3.3015 4.5144 3.5685 4.7176 6.0342 2.2433 1.7207 3.6511 2.5328 1.4498 2.8929 2.3802 2.4675 2.6963 1.6770 2.4239 1.6550 1.7938 3.6479 1.2386 3.1961 1.7686 1.3664 1.2691 2.8922 1.2763 1.7135 1.5201 3.5706 6.1114 1.2385 1.2935 5.0656 3.1631 1.3188 1.0488 1.0555 1.0905 1.1013 1.0477 1.2003 1.8391 6.9568 5.7012 5.5597 10.4252 1.0595 1.0385 1.0659 1.0926 1.0370 1.0719 1.0958 1.0983 1.1039 1.0963 1.0979 1.1018 1.0938 1.0765
irintensity: 0.0393 0.6722 6.8256 10.7725 1.2993 0.1812 1.5156 1.0183 0.6890 1.1386 3.6524 1.7127 1.1530 1.8358 3.3323 0.9439 1.1227 9.4973 6.6158 8.1078 13.0173 9.3890 1.0572 3.3646 2.5363 39.8948 14.5138 40.1933 1.1799 5.5390 6.1311 42.0813 5.8373 0.2844 1.3500 8.6679 38.5395 14.2994 14.9398 244.2208 10.7937 7.5482 10.5950 12.5728 4.9772 220.0238 0.5864 458.9666 41.9402 2.9791 2.4068 141.7272 5.8456 2.8510 12.7668 82.1923 28.3030 57.5507 85.0108 150.0224 18.5970 96.2011 15.9496 24.9024 13.9067 7.4018 22.1533 38.3291 245.8449 184.7102 216.3718 124.4946 179.5850 39.4228 6.8116 20.9187 11.3907 1.7530 55.2713 18.2440 13.3496 42.0478 6.6756 6.5499 11.8845 12.9613 16.3077
temp: 298.150 k
press: 1.00000 atm
elementType: 8 8 8 7 7 6 6 6 6 6 6 6 6 6 6 6 6 1 1 1 1 1 1 1 1 1 1 1 1 1 1
symmnumber: 1
zpe: 637226.0 jmol-1
zpe.correction: 0.242707 hartree
zpe.thermalcorrener: 0.258709 hartree
zpe.thermalcorrenthalpy: 0.259653 hartree
zpe.thermalcorrgfe: 0.197357 hartree
zpe.sumelectzpe: -799.630858 hartree
zpe.sumelectthermal: -799.614855 hartree
zpe.sumelectthermalent: -799.613911 hartree
zpe.sumelectthermalfe: -799.676207 hartree
dipole: 5.2285 2.2898 -0.6179
dipole: 5.7413
quadrupole: -75.7339 -99.3015 -104.2877
quadrupole: 8.3114 8.1921 -0.3775
quadrupole: 17.3738 -6.1938 -11.1800 8.3114 8.1921 -0.3775
hfenergy: -799.8735641 hartree
pointgroup: C01 [X(C12H14N2O3)]
dipole: -1.9615775 -1.0934558 -0.2422821 debye
polarizability: 196.8266258|1.0578451|179.3041977|-4.9336245|-5.3538541|95.0909583 unknown
InChI: InChI=1S/C12H14N2O3/c1-7(15)13-11-6-12(17-8(2)16)14-10-5-3-4-9(10)11/h6,13H,3-5H2,1-2H3
charge 0 multiplicity 1
31 atoms
O  2.348002 1.186099 -0.591594
O  -2.17789 2.898956 -0.091716
O  3.329453 0.797297 1.509757
N  1.492196 -0.99365 -0.258228
N  -2.47548 0.580166 0.135369
C  -1.049283 -3.708457 -0.102488
C  -1.893516 -2.446435 0.29038
C  0.443976 -3.29162 0.067257
C  -0.922982 -1.299027 0.061574
C  0.399745 -1.780578 -0.066095
C  -1.150265 0.100597 -0.005511
C  -0.02517 0.946754 -0.208061
C  1.237392 0.333407 -0.316911
C  -2.935015 1.906597 0.095165
C  -4.44287 2.037154 0.305278
C  3.405326 1.268226 0.363492
C  4.564808 2.017258 -0.250568
H  -1.316867 -4.590273 0.503726
H  -1.243293 -3.957734 -1.161501
H  -2.203226 -2.494395 1.355066
H  -2.818697 -2.378271 -0.315896
H  1.113048 -3.754068 -0.677968
H  0.835029 -3.56461 1.067201
H  -0.13405 2.028326 -0.272056
H  -3.185876 -0.13928 0.28958
H  -5.008438 1.456518 -0.446964
H  -4.719153 3.097187 0.215245
H  -4.737648 1.678737 1.309136
H  5.057069 1.373666 -1.001589
H  5.290887 2.287249 0.52968
H  4.207085 2.919406 -0.77346
