program: Gaussian 09
title: 000220410
version: EM64L-G09RevD.01
frameworkgroup: C1[X(C12H10N2O4)]
method: RPBEPBE
basis: SDD
operation: Freq
keyword: #p
keyword: freq=noraman
keyword: PBEPBE/SDD
title: #p freq=noraman PBEPBE/SDD
converged: YES YES NO NO
title: Mulliken charges:
elementType: O O O O N N C C C C C C C C C C C C H H H H H H H H H H
charge: -0.262572 -0.267290 -0.410777 -0.238973 -0.187821 -0.360150 0.238616 0.105986 0.440208 -0.545023 -0.400637 0.182462 -0.335968 -0.407241 -0.214484 -0.201871 0.193801 -0.241075 0.301880 0.292176 0.351470 0.320526 0.288449 0.265355 0.235345 0.236001 0.237221 0.384386
chargesum: 0.00000
title: Mulliken charges with hydrogens summed into heavy atoms:
elementType: O O O O N N C C C C C C C C C C C C
charge: -0.262572 -0.267290 -0.026390 -0.238973 -0.187821 -0.008680 0.238616 0.105986 0.440208 0.049033 -0.080111 0.182462 -0.047520 -0.141887 0.020861 0.034130 0.193801 -0.003854
polarizability: 2.34263512e+02 -1.28431588e+01 1.73817919e+02 6.77371485e+00 1.18383967e+01 7.79319300e+01
1716.lowfreq: -7.8974 -4.8746 -0.0011 -0.0011 -0.0009 3.3532 10.4753 26.0075 49.0480
frequency: 10.3022 25.9940 49.0471 61.3083 83.2638 104.3673 146.5734 171.8082 215.6598 236.9401 280.3198 303.0630 304.8611 346.7016 402.8503 406.8409 421.7419 476.2384 494.5105 512.1743 535.7996 538.3434 598.2535 613.9383 624.3048 634.7601 657.8016 691.8456 696.9469 723.6770 763.3301 800.6336 824.3573 840.5999 890.8668 905.8894 915.3465 968.7839 969.9399 974.3798 986.9713 995.8734 1025.9666 1047.6557 1072.7689 1089.7503 1169.7881 1177.0211 1194.3811 1202.6267 1225.7116 1240.7298 1256.5588 1305.7878 1315.8302 1329.5617 1382.8785 1392.5049 1413.0991 1434.1599 1452.4147 1480.0746 1553.3331 1588.5395 1593.9655 1607.0117 1660.0310 1670.9360 2999.3211 3033.7796 3134.1144 3142.7851 3154.7334 3170.9047 3189.4356 3203.2302 3515.1583 3522.9798
redmass: 10.1351 5.5885 4.4101 3.7028 6.0778 8.8050 7.1360 3.4400 6.5710 7.3741 6.4944 9.2227 8.4392 4.0692 2.8899 4.7986 7.3812 8.5459 2.4835 2.7734 2.1434 1.9757 6.5687 6.3041 5.4030 1.3983 3.7021 2.8505 3.3242 6.6118 1.7695 5.9146 4.3952 1.3685 4.3031 1.9013 1.4151 2.0612 1.8338 1.9095 5.1403 1.3660 2.4952 2.4047 2.7065 1.6174 2.8334 1.0537 1.1285 1.1235 4.1817 1.7316 3.2691 3.3377 2.2160 1.4043 6.0104 2.1569 1.1700 2.1035 2.3528 2.2540 10.6053 6.7778 6.4400 6.1270 6.8437 8.3971 1.0628 1.0936 1.0859 1.0891 1.0945 1.1001 1.0939 1.0955 1.0641 1.0791
irintensity: 1.2017 0.3409 0.6890 3.2367 1.1936 7.2704 2.3347 1.5514 0.2038 2.6308 0.4976 3.4738 4.5851 0.8443 3.8758 2.9961 20.6868 17.4580 33.3757 20.9342 65.1743 96.0266 0.6245 2.4423 10.2761 86.5841 85.4143 9.1010 30.4257 1.8930 70.8026 11.3710 9.4883 3.1759 15.1032 4.8793 2.6597 15.0073 10.9366 9.3456 0.3739 0.3581 15.7511 314.7974 63.2506 4.5224 47.4529 0.1833 2.3507 0.5153 8.0811 29.7134 92.8817 30.7026 32.2109 0.8200 25.2175 71.9492 43.2505 20.1406 2.2274 79.5707 170.9196 222.4952 148.5010 32.1858 68.4843 161.2356 4.3081 0.6799 2.5542 3.7912 19.4346 21.5718 16.2259 1.0587 36.5935 50.7955
temp: 298.150 k
press: 1.00000 atm
elementType: 8 8 8 8 7 7 6 6 6 6 6 6 6 6 6 6 6 6 1 1 1 1 1 1 1 1 1 1
symmnumber: 1
zpe: 533275.7 jmol-1
zpe.correction: 0.203114 hartree
zpe.thermalcorrener: 0.218868 hartree
zpe.thermalcorrenthalpy: 0.219812 hartree
zpe.thermalcorrgfe: 0.156942 hartree
zpe.sumelectzpe: -872.387555 hartree
zpe.sumelectthermal: -872.371801 hartree
zpe.sumelectthermalent: -872.370857 hartree
zpe.sumelectthermalfe: -872.433727 hartree
dipole: 2.5027 -2.3996 -0.1442
dipole: 3.4702
quadrupole: -76.7899 -122.4384 -102.3755
quadrupole: 11.8813 0.7801 4.5865
quadrupole: 23.7447 -21.9038 -1.8409 11.8813 0.7801 4.5865
hfenergy: -872.5906694 hartree
pointgroup: C01 [X(C12H10N2O4)]
dipole: -0.9727754 0.9179939 -0.2738289 debye
polarizability: 234.1048088|-14.1498071|164.5876314|-1.9427439|-31.1474501|87.3209212 unknown
InChI: InChI=1S/C12H10N2O4/c15-10-6-8(7-11(16)17)12(18)14(13-10)9-4-2-1-3-5-9/h1-6,13,16H,7H2
charge 0 multiplicity 1
28 atoms
O  0.189017 1.851217 -0.47503
O  0.896565 -3.517725 0.339134
O  5.101112 1.748951 -0.189249
O  4.696524 -0.4261 0.494924
N  -0.706506 -0.292192 -0.160319
N  -0.463302 -1.671495 0.053984
C  1.737862 0.02332 -0.098728
C  0.374533 0.608142 -0.272427
C  -2.093308 0.106957 -0.120059
C  2.82451 1.069076 -0.22804
C  1.924682 -1.312958 0.150074
C  0.799588 -2.25953 0.202298
C  -2.570651 1.136541 -0.969202
C  -2.980414 -0.56197 0.764018
C  -3.937142 1.483459 -0.930573
C  -4.346662 -0.210004 0.781513
C  4.253176 0.663754 0.072615
C  -4.831935 0.812368 -0.065072
H  2.568636 1.937928 0.410177
H  2.799569 1.500895 -1.247897
H  -1.274795 -2.284388 -0.066729
H  2.922231 -1.732217 0.297505
H  -1.880161 1.661732 -1.630308
H  -2.604698 -1.319585 1.460502
H  -4.303161 2.28054 -1.586226
H  -5.025544 -0.725713 1.468823
H  -5.891794 1.086654 -0.046123
H  6.039872 1.490044 0.019116
