program: Gaussian 09
title: 000018704
version: EM64L-G09RevD.01
frameworkgroup: C1[X(C9H8Cl2O3)]
method: RPBEPBE
basis: SDD
operation: Freq
keyword: #p
keyword: freq=noraman
keyword: PBEPBE/SDD
title: #p freq=noraman PBEPBE/SDD
converged: YES YES NO NO
title: Mulliken charges:
elementType: Cl Cl O O O C C C C C C C C C H H H H H H H H
charge: -0.017352 -0.011701 -0.263689 -0.420962 -0.189811 -0.075065 0.412055 -0.710683 -0.295017 -0.393419 0.172485 -0.078543 -0.166993 -0.140784 0.249953 0.252924 0.245469 0.224761 0.295105 0.263282 0.260683 0.387302
chargesum: 0.00000
title: Mulliken charges with hydrogens summed into heavy atoms:
elementType: Cl Cl O O O C C C C C C C C C
charge: -0.017352 -0.011701 -0.263689 -0.033660 -0.189811 0.174887 0.412055 0.012472 0.000088 -0.130137 0.172485 -0.078543 0.093690 -0.140784
polarizability: 1.71096124e+02 7.16352079e+00 1.32369250e+02 8.02149771e+00 -7.20962519e+00 7.25588859e+01
1716.lowfreq: -9.1990 -5.9820 -0.0021 0.0012 0.0012 4.8189 24.2115 36.7632 48.3597
frequency: 24.1811 36.7196 48.3589 92.8971 115.4708 178.1734 182.3684 203.4282 226.9758 251.2873 263.7791 291.4625 324.8459 378.8350 415.6064 444.5841 465.6624 501.1364 567.4379 602.3696 623.6731 645.0690 671.0254 685.9395 717.0228 776.8497 813.6317 832.1392 856.5460 931.2241 947.6463 995.5398 1022.6607 1031.7894 1086.0352 1118.3254 1132.3033 1138.8587 1208.6228 1238.8257 1263.2595 1322.3957 1344.7279 1361.7940 1391.9652 1393.1677 1459.8821 1463.4762 1473.8235 1569.1206 1600.7127 1682.5599 3005.1307 3023.4917 3107.9135 3119.8311 3164.2030 3173.8971 3185.0263 3508.2635
redmass: 11.6534 10.0848 6.1662 6.1980 5.5082 5.8191 25.5580 4.4010 1.1735 4.0653 4.0189 7.2648 7.4985 6.9888 9.3605 3.1433 6.3290 4.3245 4.8238 2.9326 1.7812 4.4449 6.0717 3.3665 4.5325 2.9389 1.3693 4.6513 1.5285 3.7486 1.3369 4.9922 2.4241 2.6281 1.8441 2.1279 1.4121 1.9863 3.6890 1.5374 1.4954 1.2615 1.6526 5.2068 1.2589 3.9736 2.2589 1.1135 1.0536 7.7816 7.2390 8.9131 1.0350 1.0856 1.0999 1.1017 1.0888 1.0921 1.0974 1.0642
irintensity: 1.6310 0.9106 0.1485 0.3463 1.6762 0.5625 0.0308 0.6110 0.2277 1.4462 0.6684 1.1222 2.8447 6.1775 0.9416 8.2087 5.9971 18.2915 6.0565 29.1159 57.3431 105.0074 7.2360 3.7689 33.1021 5.5409 33.3425 28.3023 42.9793 45.6209 0.1471 54.4537 248.8616 47.2833 53.5529 63.8532 5.8709 1.5564 181.6405 1.9266 15.0601 2.5393 16.7517 24.3095 25.6323 4.4010 187.3949 32.8350 13.9109 52.0869 52.8999 174.2418 11.5878 14.3979 14.7682 11.9712 1.3238 0.5341 1.5604 30.2067
temp: 298.150 k
press: 1.00000 atm
elementType: 17 17 8 8 8 6 6 6 6 6 6 6 6 6 1 1 1 1 1 1 1 1
symmnumber: 1
zpe: 398978.2 jmol-1
zpe.correction: 0.151963 hartree
zpe.thermalcorrener: 0.165908 hartree
zpe.thermalcorrenthalpy: 0.166852 hartree
zpe.thermalcorrgfe: 0.108948 hartree
zpe.sumelectzpe: -1492.507966 hartree
zpe.sumelectthermal: -1492.494021 hartree
zpe.sumelectthermalent: -1492.493077 hartree
zpe.sumelectthermalfe: -1492.550981 hartree
dipole: -3.2623 0.0280 -1.4485
dipole: 3.5696
quadrupole: -92.7471 -86.5168 -99.5009
quadrupole: -8.3248 6.4109 3.0441
quadrupole: 0.1745 6.4048 -6.5793 -8.3248 6.4109 3.0441
hfenergy: -1492.6599286 hartree
pointgroup: C01 [X(C9H8Cl2O3)]
dipole: 1.2087761 -0.3255406 0.6365036 debye
dipolederiv: -0.1088318 0.0882333 0.0129985 0.1729901 -0.6507804 -0.1545388 0.0361147 -0.1636707 -0.080591 -0.7035335 0.1700449 -0.1050825 0.1979463 -0.1121705 0.0217878 -0.1107253 0.0184418 -0.0502729 -1.8471473 0.2394398 -0.2334074 0.2679058 -0.3521331 0.0705774 -0.3449796 0.0793935 -0.3307744 -0.508992 -0.147483 -0.1112596 -0.2145122 -0.9583197 -0.404247 -0.0559085 -0.2794997 -0.4144274 -0.3707663 -0.0180555 0.1345426 -0.1339544 -0.5223809 0.0501026 0.124193 -0.1823105 -0.8597781 0.9928157 0.0270055 0.0741146 0.365759 0.0970562 0.105872 0.2817625 0.0280121 0.2825445 1.5152332 -0.2776695 0.1854651 -0.6295977 0.2414369 -0.081045 0.1587867 -0.0380918 0.1390772 -0.0944914 -0.0107333 0.0361733 0.027117 0.0150761 0.0324599 -0.0133224 0.0483399 0.016158 -0.3679072 0.0604541 -0.0271287 0.3427548 -0.3392117 -0.0025459 0.0662348 -0.0447295 -0.1602906 -0.3875774 0.0967467 -0.0023674 -0.0759012 0.0169478 0.0409017 -0.0753827 0.0923999 -0.1623868 0.273963 0.2388552 -0.1397905 0.3147435 1.1935967 0.2069619 -0.2334453 0.323539 1.0787215 0.1154402 -0.0920877 -0.0001251 -0.1716945 0.9745451 0.2884352 -0.0120045 0.2823273 0.0613719 -0.0647487 -0.0662555 -0.0163883 0.0312266 0.0950705 0.0643181 0.013807 0.0361757 -0.0618369 0.8838866 -0.2255981 0.1680098 -0.3152493 -0.199738 -0.1167715 0.1479891 -0.0961844 -0.0746214 -0.0306049 0.0417184 0.0608839 -0.0669884 0.0080743 -0.0925096 0.0118555 -0.0426277 -0.0493533 0.1017395 0.0140676 0.0113658 0.0580988 0.0583502 -0.0353394 0.0541696 -0.0861145 -0.0368523 0.0955297 -0.0314802 0.042892 -0.0072245 -0.0140741 0.1181798 0.0515725 0.0875847 0.0161404 -0.0642663 -0.051042 -0.0586369 -0.0915247 0.0336727 -0.0567296 -0.0711402 -0.0333197 0.0888301 0.0707999 -0.0332382 -0.0544845 -0.0413428 0.0772678 -0.0318144 -0.067677 -0.0338925 0.1476157 0.0886243 0.0515333 -0.0067482 0.0420178 -0.0064816 -0.0434879 -0.0092885 -0.0441227 0.1572323 0.0212823 -0.050771 -0.0485583 -0.0428577 0.0505457 -0.0451739 -0.0474785 -0.0462838 0.1358418 0.3895523 -0.0236847 0.0775317 -0.0297125 0.2936501 0.0646065 0.0948671 0.0946337 0.1576516 unknown
polarizability: 164.7690696|-16.564794|133.9598585|14.9934136|12.8164793|77.2953322 unknown
InChI: InChI=1S/C9H8Cl2O3/c1-5(9(12)13)14-6-2-3-7(10)8(11)4-6/h2-5,12H,1H3
charge 0 multiplicity 1
22 atoms
Cl -2.126139 2.660682 0.6741
Cl -4.483857 0.688254 -0.519452
O  1.094659 -1.481368 0.246443
O  2.827084 1.627646 0.351691
O  2.827628 0.198447 -1.489355
C  2.202918 -0.66363 0.764127
C  -0.167898 -0.882585 0.091206
C  3.355393 -1.63872 1.032549
C  -0.46478 0.46074 0.424436
C  -1.175814 -1.73434 -0.422793
C  2.631766 0.387872 -0.275842
C  -1.780883 0.93526 0.237206
C  -2.479732 -1.242176 -0.602086
C  -2.790598 0.096674 -0.271475
H  1.896415 -0.145505 1.691976
H  3.643489 -2.148849 0.098737
H  3.03403 -2.392939 1.769497
H  4.230761 -1.099625 1.434641
H  0.288356 1.147977 0.817949
H  -0.921242 -2.766395 -0.677147
H  -3.264966 -1.890925 -1.000362
H  3.153109 2.297406 -0.309846
