program: Gaussian 09
title: 000220407
version: EM64L-G09RevD.01
frameworkgroup: C1[X(C14H13NO2)]
method: RPBEPBE
basis: SDD
operation: Freq
keyword: #p
keyword: freq=noraman
keyword: PBEPBE/SDD
title: #p freq=noraman PBEPBE/SDD
converged: YES YES NO NO
title: Mulliken charges:
elementType: O O N C C C C C C C C C C C C C C H H H H H H H H H H H H H
charge: -0.326615 -0.272961 -0.469832 0.325677 0.168048 0.250961 0.131981 -0.324324 -0.323511 -0.234650 -0.249569 -0.350773 -0.342568 -0.241706 -0.225129 -0.228033 -0.527251 0.354333 0.312108 0.238216 0.227533 0.225216 0.218899 0.275062 0.228465 0.231983 0.231974 0.226818 0.241689 0.227960
chargesum: 0.00000
title: Mulliken charges with hydrogens summed into heavy atoms:
elementType: O O N C C C C C C C C C C C C C C
charge: -0.326615 -0.272961 -0.115499 0.325677 0.168048 0.250961 0.131981 -0.012216 -0.085295 -0.007117 -0.024354 -0.131875 -0.067507 -0.013240 0.006854 0.003941 0.169216
polarizability: 2.69821198e+02 9.18451432e+00 1.80816631e+02 5.58453642e+00 -6.11824583e+00 7.27652615e+01
1716.lowfreq: -4.9648 -2.2009 -0.0010 -0.0007 -0.0004 8.2650 29.5557 43.0026 66.4032
frequency: 29.3303 42.9755 66.3862 82.2927 101.0650 153.3482 175.0894 203.4399 214.5786 246.5664 286.4208 311.6966 318.1420 401.8244 416.5526 455.4003 465.4700 493.6335 542.2730 559.1790 581.9542 614.5563 670.4994 684.5057 698.9212 719.5412 743.7079 748.0442 754.8955 790.9133 829.9919 854.4804 854.9194 870.6592 935.3544 938.8163 984.0954 987.2437 989.1987 996.0501 1005.7852 1024.7788 1039.6871 1079.7709 1088.4361 1116.6354 1117.3992 1151.9718 1173.1262 1173.5108 1192.6295 1199.0518 1250.6908 1257.9144 1303.7255 1321.4745 1384.5955 1394.0889 1426.7911 1434.0142 1449.9054 1465.7306 1466.6949 1477.9028 1488.0432 1518.5591 1571.7765 1602.6354 1603.7699 1610.3891 1614.0435 2967.3073 3057.8045 3117.8988 3126.0648 3131.5634 3136.2030 3144.7874 3154.1329 3157.9728 3169.6289 3169.8371 3196.2327 3509.2576
redmass: 3.7616 5.7033 4.7483 4.2283 4.1981 4.4747 3.7339 2.5767 3.9486 1.7344 4.0045 4.1560 5.9812 2.8314 5.2319 3.8536 4.0960 5.4318 5.3346 3.7581 6.4272 6.4229 5.9535 4.9059 1.4809 1.5492 2.4105 5.5367 1.2540 2.4732 5.1005 1.3102 1.3676 6.0620 1.4465 1.3477 1.4229 1.3009 5.3648 8.4307 1.3431 2.5199 2.0990 2.2001 2.0141 1.9893 1.2576 1.4058 1.0598 1.0751 1.1336 2.2722 3.6055 1.7792 1.7453 1.3976 8.7108 6.1887 1.6776 2.0876 1.7190 1.4495 1.1507 1.4288 1.9856 2.4233 6.1831 5.5398 7.5281 5.3246 5.9112 1.0323 1.1044 1.0871 1.1002 1.0872 1.0858 1.0921 1.0915 1.0957 1.0996 1.0984 1.0953 1.0756
irintensity: 0.0614 2.1811 0.6126 0.6177 7.9590 3.0540 2.5709 0.3665 2.1267 1.0709 5.2957 1.5052 5.2254 0.0919 0.9109 4.1442 9.8996 1.3794 17.7471 2.0210 10.6294 0.8430 7.7961 3.5106 38.1805 54.6966 17.9390 8.5420 175.4077 14.2091 2.3074 0.0276 1.6108 17.9101 1.8349 8.9732 1.5655 4.0623 0.4643 54.4100 1.7459 9.0258 22.3989 8.5317 34.1085 28.2043 0.2191 0.1736 2.3679 3.1803 9.6604 61.3129 69.0853 88.4066 52.2942 12.2646 0.8064 64.7301 79.1540 11.0964 72.3346 71.5898 31.3292 28.8657 32.2997 518.7798 65.0461 45.7460 20.9068 19.5255 21.5131 68.1857 42.4561 10.3921 18.8270 1.7470 1.0006 23.1056 22.2738 17.1281 43.8236 1.9205 7.6912 41.1076
temp: 298.150 k
press: 1.00000 atm
elementType: 8 8 7 6 6 6 6 6 6 6 6 6 6 6 6 6 6 1 1 1 1 1 1 1 1 1 1 1 1 1
symmnumber: 1
zpe: 621210.2 jmol-1
zpe.correction: 0.236606 hartree
zpe.thermalcorrener: 0.251327 hartree
zpe.thermalcorrenthalpy: 0.252271 hartree
zpe.thermalcorrgfe: 0.193569 hartree
zpe.sumelectzpe: -745.294009 hartree
zpe.sumelectthermal: -745.279289 hartree
zpe.sumelectthermalent: -745.278344 hartree
zpe.sumelectthermalfe: -745.337047 hartree
dipole: -1.0017 5.0544 0.2641
dipole: 5.1594
quadrupole: -76.3878 -90.5258 -104.8592
quadrupole: -2.9804 0.8000 -1.6065
quadrupole: 14.2031 0.0651 -14.2683 -2.9804 0.8000 -1.6065
hfenergy: -745.5306152 hartree
pointgroup: C01 [X(C14H13N1O2)]
dipole: 0.3075009 -1.7561841 -0.9704018 debye
polarizability: 270.117654|9.6873479|145.0464797|-5.5368475|50.6565102|108.2389569 unknown
InChI: InChI=1S/C14H13NO2/c1-17-13-10-6-5-9-12(13)15-14(16)11-7-3-2-4-8-11/h2-10,15H,1H3
charge 0 multiplicity 1
30 atoms
O  1.696749 -1.786848 -0.747538
O  -0.756688 1.919388 1.377914
N  0.136695 0.047309 0.283792
C  1.525138 0.313255 0.367794
C  2.384494 -0.68332 -0.19465
C  -2.297802 0.294274 0.437763
C  -0.919651 0.831552 0.739044
C  2.101068 1.466514 0.952532
C  3.783197 -0.529853 -0.175935
C  3.507107 1.618154 0.967756
C  4.345788 0.630953 0.409565
C  -2.571208 -0.654874 -0.583796
C  -3.372639 0.806097 1.209537
C  -3.893146 -1.095591 -0.811774
C  -4.691576 0.362226 0.984138
C  -4.95593 -0.593946 -0.025031
C  2.494886 -2.863557 -1.334147
H  -0.07741 -0.856659 -0.147125
H  1.43923 2.218281 1.385635
H  4.436556 -1.293863 -0.607473
H  3.942402 2.514513 1.4216
H  5.433877 0.753804 0.425585
H  -1.772938 -1.031187 -1.235467
H  -3.143732 1.555999 1.973642
H  -4.095424 -1.820894 -1.607548
H  -5.512415 0.760818 1.590246
H  -5.980814 -0.937735 -0.203668
H  3.097386 -2.492894 -2.185334
H  1.766364 -3.607137 -1.689461
H  3.159333 -3.322775 -0.577596
