program: Gaussian 09
title: 000220429
version: EM64L-G09RevD.01
frameworkgroup: C1[X(C24H21NO2)]
method: RPBEPBE
basis: SDD
operation: Freq
keyword: #p
keyword: freq=noraman
keyword: PBEPBE/SDD
title: #p freq=noraman PBEPBE/SDD
converged: YES YES NO NO
title: Mulliken charges:
elementType: O O N C C C C C C C C C C C C C C C C C C C C C C C C H H H H H H H H H H H H H H H H H H H H H
charge: -0.231937 -0.256820 -0.012204 -0.282806 -0.293838 -0.595650 0.547145 0.515590 0.142673 -0.419285 -0.408667 -0.234566 -0.388720 -0.419589 0.303514 -0.250170 -0.226690 -0.243427 -0.234370 -0.225238 -0.314301 -0.357638 -0.240612 -0.375842 -0.358777 0.331920 -0.536630 0.274246 0.257969 0.236301 0.272041 0.221113 0.241294 0.243736 0.233316 0.223320 0.225293 0.227455 0.227596 0.227110 0.245897 0.276047 0.229779 0.255013 0.245682 0.226616 0.227369 0.249743
chargesum: 0.00000
title: Mulliken charges with hydrogens summed into heavy atoms:
elementType: O O N C C C C C C C C C C C C C C C C C C C C C C C C
charge: -0.231937 -0.256820 -0.012204 -0.008560 -0.035870 -0.087308 0.547145 0.515590 0.142673 -0.198172 -0.167373 -0.234566 -0.144984 -0.186274 0.303514 -0.026851 -0.001397 -0.015972 -0.006774 0.001872 -0.068404 -0.081591 -0.010833 -0.120829 -0.113095 0.331920 0.167098
polarizability: 3.51727995e+02 1.95983599e+01 2.30830139e+02 2.34564586e+01 1.25987833e+00 2.19099600e+02
1716.lowfreq: -8.6055 -5.8304 -1.8167 -0.0008 0.0003 0.0004 12.6869 18.3015 20.6254
frequency: 12.3965 18.1069 20.5285 31.8145 39.9524 42.4275 57.4183 75.1683 84.4041 86.6448 123.0484 131.3879 159.0288 170.6147 183.1571 211.1354 216.9243 233.5216 252.7168 292.4839 316.9757 321.1384 349.1512 371.4856 401.9240 402.6693 413.3172 428.8780 453.8808 487.2447 503.6539 515.5455 528.0410 555.2601 561.7228 594.5371 611.4349 615.9153 618.8662 627.4532 638.0969 702.1901 703.3425 731.1476 735.7592 763.2220 770.1016 782.0534 791.2463 823.4557 833.8547 840.1556 846.9910 851.3410 911.5513 917.8390 945.9666 953.2609 970.1703 971.5117 976.3932 981.0915 986.5083 986.9726 991.2974 992.1691 994.3969 996.3189 1004.8065 1017.6587 1028.1851 1029.0057 1071.2214 1082.3436 1088.7482 1111.0176 1114.9751 1156.2780 1170.3880 1172.1165 1172.7169 1174.2388 1188.4680 1191.0755 1193.8832 1201.7137 1206.7856 1240.3873 1242.7330 1259.9058 1290.6079 1301.1492 1304.5274 1332.1433 1337.7028 1354.7602 1373.9480 1384.5737 1387.3176 1428.9050 1436.2285 1440.6477 1442.9306 1443.9426 1468.2365 1470.7195 1483.1554 1483.8418 1500.5246 1558.0195 1585.0981 1593.6791 1596.6069 1612.9190 1613.5582 1621.8072 2183.1371 2968.6820 2969.3659 2991.8267 3028.5260 3044.1154 3060.5201 3099.9211 3122.0104 3125.4144 3126.3086 3132.3319 3136.4001 3137.8524 3145.8471 3147.8969 3148.3617 3149.1472 3163.8411 3165.6263 3167.0508 3173.1428
redmass: 5.8674 4.9540 4.2362 4.0923 4.1440 4.5557 5.3028 6.2303 5.4063 6.3715 7.7681 4.5729 4.9577 4.8507 4.9754 2.5840 1.3703 4.1729 3.1971 3.9774 5.7268 5.1815 5.1850 6.2352 2.7854 2.8031 2.9468 6.8247 4.6134 3.0690 4.2459 3.6241 3.4702 3.6710 3.6157 3.9418 5.2401 6.2629 6.0676 7.0833 5.5912 1.6438 1.7427 4.1888 4.0724 1.9871 2.1808 3.1896 5.5793 1.2530 3.4187 1.8807 1.2622 1.2510 1.5107 1.4425 2.4783 3.0323 1.5073 1.4585 1.4033 7.4333 4.1400 1.5124 4.6293 5.1008 1.4546 1.3808 2.6055 4.0964 2.2746 2.2155 2.4659 1.7140 1.7142 1.2595 1.3412 1.3418 1.2326 1.0561 1.2424 1.0652 1.2203 1.5289 1.1277 1.5866 1.8723 2.7563 2.6119 1.6336 1.3115 1.3475 1.4879 1.5484 1.3039 1.5329 4.7217 7.8195 4.8747 3.3045 1.2826 1.1444 2.1416 2.0477 1.0501 1.0694 2.2752 2.2797 2.4748 7.8419 7.4734 5.9873 6.1257 6.1132 6.0972 6.6466 12.5697 1.0355 1.0597 1.0815 1.0888 1.0904 1.1044 1.0877 1.0862 1.0859 1.0870 1.1000 1.0911 1.0917 1.0883 1.0878 1.0956 1.0962 1.1013 1.1016 1.0958 1.0966
irintensity: 0.9434 0.4350 0.4095 0.0353 0.4422 0.3707 2.2836 1.9785 0.0528 1.1575 7.0494 9.7122 1.6578 0.6985 3.7721 0.5836 0.2957 3.2970 0.9570 1.5913 1.9574 0.5050 3.9084 0.0964 0.0341 0.1946 0.1053 7.5715 2.8615 6.3104 2.3697 7.3439 4.7593 53.6220 40.4677 12.0099 8.5298 1.2490 4.0103 2.4884 1.5157 89.1088 34.7055 3.7626 1.7945 16.2856 33.7780 20.3743 1.6848 0.3283 21.5586 55.2025 0.5975 0.0796 3.5082 2.0155 5.7967 20.9414 4.2658 1.7445 0.2788 84.3317 10.4964 3.1533 2.1235 4.8219 2.7646 0.1138 10.0112 2.0789 8.3039 1.4244 3.2696 14.5054 2.2794 0.1864 12.5643 0.2673 7.0452 1.6758 231.8145 1.0826 5.7362 3.3852 3.2318 6.8394 6.5222 58.8275 283.2313 25.3782 67.2659 3.8730 50.8406 68.8226 5.3623 3.0191 66.4392 0.2256 0.2398 0.8780 16.4741 9.2833 3.9931 19.5377 15.2327 54.7071 17.8503 9.4306 25.9552 100.5669 171.2905 0.6700 1.3435 2.9697 9.9443 155.5638 13.7551 84.4434 13.7761 4.4863 1.4946 17.3473 40.9474 15.6374 4.6562 0.2917 0.7926 23.2630 19.0463 14.3076 9.6397 1.4378 22.4980 39.5622 19.1952 22.7938 14.0102 4.8343
temp: 298.150 k
press: 1.00000 atm
elementType: 8 8 7 6 6 6 6 6 6 6 6 6 6 6 6 6 6 6 6 6 6 6 6 6 6 6 6 1 1 1 1 1 1 1 1 1 1 1 1 1 1 1 1 1 1 1 1 1
symmnumber: 1
zpe: 998067.8 jmol-1
zpe.correction: 0.380144 hartree
zpe.thermalcorrener: 0.404528 hartree
zpe.thermalcorrenthalpy: 0.405472 hartree
zpe.thermalcorrgfe: 0.321552 hartree
zpe.sumelectzpe: -1130.438197 hartree
zpe.sumelectthermal: -1130.413813 hartree
zpe.sumelectthermalent: -1130.412869 hartree
zpe.sumelectthermalfe: -1130.496789 hartree
dipole: -2.5746 3.9448 -0.5909
dipole: 4.7475
quadrupole: -113.2965 -172.9691 -150.0529
quadrupole: 4.2069 -4.7039 -4.6987
quadrupole: 32.1430 -27.5296 -4.6134 4.2069 -4.7039 -4.6987
hfenergy: -1130.8183408 hartree
pointgroup: C01 [X(C24H21N1O2)]
dipole: -1.154414 1.4304629 -0.3314277 debye
polarizability: 344.9430409|32.2036201|236.2907996|26.0764931|3.9810505|220.4238932 unknown
InChI: InChI=1S/C24H21NO2/c1-27-21-14-12-20(13-15-21)24(26)16-22(18-8-4-2-5-9-18)23(17-25)19-10-6-3-7-11-19/h2-15,22-23H,16H2,1H3
charge 0 multiplicity 1
48 atoms
O  -1.189803 0.227604 1.773362
O  -6.994626 -0.958394 -0.806062
N  1.761791 -3.579572 -0.560569
C  0.998995 -0.159114 0.066971
C  2.160812 -0.939711 -0.676783
C  -0.401431 -0.669144 -0.354152
C  1.149655 1.346609 -0.166855
C  3.543006 -0.567934 -0.117806
C  -1.498244 -0.241777 0.635424
C  1.032596 1.900076 -1.468709
C  1.40956 2.218326 0.917647
C  1.944939 -2.40099 -0.611972
C  3.98326 -1.088163 1.124664
C  4.374088 0.334249 -0.822675
C  -2.927358 -0.425851 0.242358
C  1.176029 3.288715 -1.681969
C  1.554744 3.608279 0.709836
C  1.440069 4.149393 -0.591044
C  5.236052 -0.709241 1.653408
C  5.627674 0.715673 -0.293986
C  -3.324982 -1.038317 -0.981987
C  -3.939559 0.014949 1.136194
C  6.062376 0.195364 0.946107
C  -4.681359 -1.202084 -1.298501
C  -5.30393 -0.1364 0.832631
C  -5.677817 -0.74981 -0.393542
C  -8.074527 -0.521612 0.087568
H  1.109783 -0.353259 1.149133
H  2.127487 -0.659696 -1.748916
H  -0.657757 -0.320602 -1.372163
H  -0.410746 -1.778781 -0.392076
H  0.821846 1.248678 -2.327797
H  1.484391 1.804464 1.929016
H  3.354545 -1.801968 1.671036
H  4.039754 0.746133 -1.782127
H  1.079961 3.699188 -2.693751
H  1.753383 4.267623 1.562243
H  1.550957 5.227475 -0.753174
H  5.56981 -1.122145 2.61185
H  6.261676 1.416202 -0.848579
H  -2.573983 -1.401772 -1.690736
H  -3.62361 0.479525 2.076315
H  7.035715 0.487538 1.355673
H  -4.999924 -1.67547 -2.231782
H  -6.058942 0.217371 1.540825
H  -8.039903 0.572296 0.251307
H  -8.026151 -1.048442 1.059491
H  -9.003004 -0.790583 -0.436046
