program: Gaussian 09
title: 000220394
version: EM64L-G09RevD.01
frameworkgroup: C1[X(C17H18N4O3)]
method: RPBEPBE
basis: SDD
operation: Freq
keyword: #p
keyword: freq=noraman
keyword: PBEPBE/SDD
title: #p freq=noraman PBEPBE/SDD
converged: YES YES NO NO
title: Mulliken charges:
elementType: O O O N N N N C C C C C C C C C C C C C C C C C H H H H H H H H H H H H H H H H H H
charge: -0.212178 -0.213849 -0.250705 0.061880 0.027199 -0.411007 -0.649580 -0.388782 -0.552141 -0.470311 0.520743 -0.018325 0.300847 -0.376726 -0.388389 -0.359150 -0.356960 0.365305 -0.402442 -0.393985 -0.230654 -0.226341 -0.235371 0.291804 0.234653 0.225304 0.220863 0.208267 0.244850 0.198930 0.250081 0.245087 0.284601 0.283456 0.278123 0.241426 0.235883 0.233180 0.237106 0.300202 0.303099 0.344009
chargesum: 0.00000
title: Mulliken charges with hydrogens summed into heavy atoms:
elementType: O O O N N N N C C C C C C C C C C C C C C C C C
charge: -0.212178 -0.213849 -0.250705 0.061880 0.027199 -0.110805 -0.002472 0.071175 -0.123010 -0.026532 0.520743 -0.018325 0.300847 -0.126645 -0.143303 -0.074549 -0.073503 0.365305 -0.124319 -0.152559 0.005228 0.006839 0.001735 0.291804
polarizability: 2.84294565e+02 2.41705727e+01 2.57206569e+02 -1.33441783e+01 8.82262760e+00 1.76706861e+02
1716.lowfreq: -12.3878 -4.9977 -0.0009 -0.0009 -0.0008 2.0351 4.8239 12.0643 21.7583
frequency: -4.7040 11.9600 21.7251 35.6743 37.2562 46.1708 57.3826 66.4671 70.2333 95.6272 114.0601 152.0383 181.0976 198.6833 207.4416 210.6860 245.7403 294.1532 295.4329 336.7489 343.3242 370.8117 399.3654 401.8398 407.4700 446.1383 451.9101 490.0162 506.5969 514.1896 516.4933 582.3767 600.6991 615.1360 627.6698 629.0891 637.8727 667.9984 672.5678 708.9178 712.0004 731.6068 736.7376 756.5114 768.9547 785.8078 821.9888 847.0645 855.3452 863.9900 864.9720 930.7731 934.4030 985.1388 985.3672 988.4258 994.3279 1002.4372 1004.7393 1009.5838 1018.2586 1026.2608 1038.3676 1046.3705 1068.8467 1080.5414 1093.0666 1111.0733 1134.3971 1152.9772 1175.2034 1180.0524 1191.3670 1218.1032 1222.8197 1242.4272 1254.1088 1278.9483 1281.5389 1300.0017 1302.7950 1313.4916 1319.8901 1337.3264 1363.3651 1369.9629 1402.5964 1419.4563 1429.5301 1451.4038 1467.7026 1477.7360 1479.9494 1484.6048 1487.0673 1571.1959 1584.1553 1594.6085 1603.9353 1605.5998 1607.5795 1681.7663 2964.5173 2980.2711 2990.7813 3028.0938 3049.2603 3069.1711 3123.7587 3128.7107 3135.2036 3138.5636 3141.0558 3150.6598 3167.4357 3180.7678 3183.1694 3388.8740 3537.2786 3695.3178
redmass: 6.1317 5.4159 7.1854 4.7972 4.8642 4.2205 6.1441 7.3910 5.1407 2.0054 6.3392 5.0391 4.8413 5.1372 4.6892 4.4722 5.6278 3.7006 1.7774 2.8666 2.8012 3.6089 3.4706 3.2658 2.8945 3.5222 5.0476 1.1763 6.8854 3.2645 3.1401 2.0101 2.9439 4.4478 6.7788 5.0474 4.3338 4.4596 4.4600 5.6031 1.8105 2.4534 4.1315 1.5657 4.3731 2.3864 4.4252 1.3320 1.3498 1.6022 1.3473 2.8197 1.4410 1.7011 1.3730 3.2975 1.3711 1.3282 3.0787 2.9870 4.6421 2.1662 3.1419 1.9703 2.0104 1.7785 3.3250 1.4762 1.4269 2.3022 1.0553 1.3331 1.1185 2.4161 6.1450 1.3434 1.4120 2.4217 1.2646 2.2131 1.2740 1.4142 1.4821 1.4434 7.5684 6.3266 8.4200 3.2965 2.2287 1.0900 1.1133 2.2277 2.3829 1.1912 1.5956 6.8365 6.5219 7.6393 1.2835 5.2356 5.9248 5.4919 1.0649 1.0589 1.0594 1.0998 1.0998 1.1016 1.0866 1.0868 1.0905 1.0907 1.0918 1.0963 1.1016 1.0942 1.0953 1.0753 1.0459 1.1035
irintensity: 0.8176 0.3191 0.7610 9.5510 3.3767 5.9233 1.9033 0.0526 2.4979 0.6727 0.8948 6.0971 3.9687 0.1948 1.1431 1.4400 0.1613 0.0331 6.7248 15.1778 0.7582 43.5253 20.4636 3.7818 0.0132 18.9805 4.6320 189.1305 0.9794 18.4460 10.8868 69.0016 29.0759 16.3687 0.2966 7.2874 18.5768 5.3738 27.3175 12.7173 52.7775 14.5222 4.4464 1.0859 6.6263 54.8433 6.6302 2.2982 4.0088 34.1502 7.4415 1.7175 1.9135 1.0419 4.0759 0.6871 0.0700 0.1830 1.7016 15.6309 19.1658 3.3118 4.8982 30.1016 33.9468 38.8613 18.5574 27.3357 16.3302 114.8820 0.4266 80.3813 0.5509 0.2731 372.8155 21.7592 8.4400 122.7590 85.7563 243.1224 1.1013 2.8646 6.2568 0.4532 96.4852 1.0366 0.5550 41.9443 10.8540 21.1020 1.5312 14.0173 19.1439 87.0037 370.9696 48.1996 15.0196 2.0479 121.8158 12.1833 67.6740 321.2655 20.8718 6.5722 45.1114 1.0298 6.6279 38.8755 3.2690 1.0298 11.9892 8.0081 7.2437 28.6990 20.1520 0.0412 3.7720 18.9418 51.0726 44.8390
temp: 298.150 k
press: 1.00000 atm
elementType: 8 8 8 7 7 7 7 6 6 6 6 6 6 6 6 6 6 6 6 6 6 6 6 6 1 1 1 1 1 1 1 1 1 1 1 1 1 1 1 1 1 1
symmnumber: 1
zpe: 857558.4 jmol-1
zpe.correction: 0.326627 hartree
zpe.thermalcorrener: 0.348432 hartree
zpe.thermalcorrenthalpy: 0.349376 hartree
zpe.thermalcorrgfe: 0.271564 hartree
zpe.sumelectzpe: -1101.466685 hartree
zpe.sumelectthermal: -1101.444879 hartree
zpe.sumelectthermalent: -1101.443935 hartree
zpe.sumelectthermalfe: -1101.521747 hartree
dipole: -7.1778 5.6419 1.1601
dipole: 9.2032
quadrupole: -170.8079 -146.1410 -133.8287
quadrupole: -22.9442 28.4801 2.7261
quadrupole: -20.5487 4.1182 16.4305 -22.9442 28.4801 2.7261
hfenergy: -1101.7933115 hartree
pointgroup: C01 [X(C17H18N4O3)]
dipole: 3.2651264 -1.5647616 -0.0256532 debye
polarizability: 272.9943908|23.5671669|266.5350254|18.7651866|16.9735021|178.6785789 unknown
InChI: InChI=1S/C17H18N4O3/c18-17(22)20-19-16(14-6-2-1-3-7-14)8-4-5-13-9-11-15(12-10-13)21(23)24/h1-3,6-7,9-12,20H,4-5,8,18H2
charge 0 multiplicity 1
42 atoms
O  -6.868069 -0.098285 -1.507239
O  -6.502663 -2.349027 -1.44127
O  3.994996 4.305586 0.675171
N  2.903365 1.712152 0.854164
N  -6.178964 -1.13175 -1.150303
N  4.017365 2.00847 0.089244
N  5.753087 3.422095 -0.580574
C  -0.100905 -0.002593 0.948542
C  -1.304153 -0.252856 1.903084
C  1.213097 0.243943 1.735718
C  -2.595498 -0.48517 1.140252
C  2.406345 0.486754 0.827579
C  2.9095 -0.641686 -0.026426
C  -3.394003 0.611856 0.715799
C  -3.008762 -1.799838 0.792733
C  -4.56821 0.412964 -0.034218
C  -4.178973 -2.023863 0.043061
C  -4.94471 -0.908529 -0.362538
C  3.026738 -0.496415 -1.438969
C  3.255696 -1.890741 0.557296
C  3.483208 -1.567467 -2.239038
C  3.719734 -2.958118 -0.242395
C  3.836141 -2.800748 -1.643382
C  4.544731 3.324407 0.115984
H  -0.312921 0.876312 0.310113
H  0.016405 -0.871035 0.271667
H  -1.408215 0.620868 2.575135
H  -1.074769 -1.128636 2.540792
H  1.101409 1.128953 2.387525
H  1.404738 -0.631184 2.391022
H  -3.091045 1.631132 0.981673
H  -2.405958 -2.655389 1.118482
H  -5.193063 1.247016 -0.364324
H  -4.510356 -3.029471 -0.228855
H  2.719771 0.44361 -1.913212
H  3.17336 -2.020812 1.642374
H  3.551849 -1.443085 -3.325463
H  3.988341 -3.911643 0.225647
H  4.190391 -3.631171 -2.263683
H  4.483355 1.275272 -0.463984
H  6.271219 2.624364 -0.943392
H  6.171895 4.347055 -0.633194
