program: Gaussian 09
title: 000220376
version: EM64L-G09RevD.01
frameworkgroup: C1[X(C8H8O3S)]
method: RPBEPBE
basis: SDD
operation: Freq
keyword: #pfreq=noraman
keyword: PBEPBE/SDD
title: #p freq=noraman PBEPBE/SDD
converged: YES YES NO NO
title: Mulliken charges:
elementType: S O O O C C C C C C C C H H H H H H H H
charge: 0.922513 -0.545152 -0.541907 -0.189855 -0.081985 -0.241701 -0.239913 -0.738190 0.397204 -0.351326 -0.335298 -0.190181 0.296842 0.293212 0.267888 0.298136 0.268840 0.249976 0.285329 0.175567
chargesum: 0.00000
title: Mulliken charges with hydrogens summed into heavy atoms:
elementType: S O O O C C C C C C C C
charge: 0.922513 -0.545152 -0.541907 -0.189855 -0.081985 0.055141 0.053299 0.096674 0.397204 -0.101350 -0.049969 -0.014614
polarizability: 1.77170872e+02 -1.90695921e+00 1.17858409e+02 -1.65722526e+00 4.72135773e-01 6.94234585e+01
1716.lowfreq: -8.2238 -3.1143 -0.0018 -0.0012 0.0023 6.5007 42.5026 65.2879 111.4800
frequency: 42.4415 65.2806 111.4779 126.5614 156.2259 184.6351 195.9683 219.7250 237.3085 289.7286 344.7059 352.3307 384.8856 411.5111 485.1266 498.1006 583.5358 614.9092 661.2372 720.6047 787.5533 812.3430 844.9946 865.8664 888.4201 967.7053 971.1527 996.4140 998.2097 1007.9079 1009.4940 1046.9765 1107.4578 1171.8471 1202.0403 1287.1074 1302.2686 1363.3124 1389.7288 1407.0844 1411.9147 1421.3363 1465.4524 1581.9908 1590.6220 1625.4504 2885.0940 3029.4790 3130.5750 3147.4208 3157.9183 3165.4309 3179.3125 3184.0979
redmass: 4.8722 5.6202 5.9175 4.3681 1.0879 3.4278 7.2310 6.9496 4.2019 4.8662 6.5368 5.3683 8.0467 2.8274 6.3024 3.3355 7.1735 7.0406 6.5838 3.6454 11.3785 4.8415 1.3598 1.2715 2.9960 1.3867 1.4284 1.6236 3.3438 1.8774 1.5968 2.5052 1.3464 1.1454 3.0654 1.2697 1.1384 1.7989 4.1261 1.0529 2.2987 1.0613 2.3070 8.0805 6.1406 7.2762 1.0857 1.0246 1.0894 1.0884 1.0957 1.0974 1.1071 1.1080
irintensity: 4.6296 5.9067 4.1518 7.5721 0.7388 2.5973 1.2566 11.0990 4.7419 17.0009 6.9992 6.2206 46.5455 0.1523 6.8546 20.8636 74.9042 2.4016 47.4058 3.3987 82.1688 26.8123 41.4038 7.0009 30.2352 54.1427 6.5453 1.2996 1.5721 56.2515 6.6040 29.1154 3.6815 3.1872 63.6493 3.4053 3.7329 7.9367 26.4630 10.2763 14.2386 17.1231 0.4375 106.6217 19.8879 132.5561 114.5421 1.2407 5.7242 2.9744 4.1638 0.4134 0.3316 0.9758
temp: 298.150 k
press: 1.00000 atm
elementType: 16 8 8 8 6 6 6 6 6 6 6 6 1 1 1 1 1 1 1 1
symmnumber: 1
zpe: 371382.3 jmol-1
zpe.correction: 0.141452 hartree
zpe.thermalcorrener: 0.153690 hartree
zpe.thermalcorrenthalpy: 0.154634 hartree
zpe.thermalcorrgfe: 0.102399 hartree
zpe.sumelectzpe: -932.324250 hartree
zpe.sumelectthermal: -932.312012 hartree
zpe.sumelectthermalent: -932.311068 hartree
zpe.sumelectthermalfe: -932.363304 hartree
dipole: 0.8554 1.7291 4.4081
dipole: 4.8117
quadrupole: -98.6150 -76.4026 -78.5137
quadrupole: 9.3897 -13.8748 -0.6230
quadrupole: -14.1046 8.1078 5.9967 9.3897 -13.8748 -0.6230
hfenergy: -932.4657021 hartree
pointgroup: C01 [X(C8H8O3S1)]
dipole: -0.3534251 0.7068317 -1.7202297 debye
dipolederiv: 1.8904176 -0.0310644 -0.0088922 -0.0438057 1.1427736 0.0031894 -0.0743401 0.0065851 1.3560975 -0.7360839 -0.0350898 -0.0079274 -0.0957841 -0.6080217 -0.1352454 0.0216219 -0.0088446 -0.5535752 -0.717699 0.0408369 0.0066121 0.1097997 -0.6075077 0.1397518 0.0173785 0.0119658 -0.562509 -1.037741 -0.1131918 -0.0028448 -0.4484519 -0.5230725 -0.0055772 -0.0153401 -0.0057228 -0.3189862 -0.056583 -0.0004342 -0.0404192 0.0096488 -0.0233329 0.0027714 -0.0513095 0.002982 -0.2282944 -0.3172825 0.2354934 0.0227551 -0.0638259 -0.0715047 0.0015449 0.0179745 0.0366372 -0.0876131 -0.3361163 -0.2124473 0.0251408 0.1089783 -0.0434973 -0.0031752 0.015665 -0.0388926 -0.08976 -0.2375072 0.0049841 -0.0069959 0.0085318 -0.111102 -0.0055174 0.0088489 -0.006857 -0.2603795 -0.7644349 0.0342809 0.0008502 0.1707816 -0.0512931 -0.0006823 -0.0113297 -0.0024293 0.0303983 0.1031179 -0.201659 0.0026348 0.1545203 0.0608932 0.0006862 0.0280196 0.0020103 -0.1274078 0.048906 0.1879999 0.0011787 -0.1755367 0.0192935 -0.0010312 0.0185573 -0.0020345 -0.083028 1.7018234 0.0472563 0.0092474 0.0482728 0.7457914 0.0093911 0.0205582 0.0092449 0.115546 0.1171598 -0.069235 -0.0063556 -0.036428 0.081659 0.0046925 -0.0066835 -0.009228 0.1541817 0.117197 0.0637264 -0.0065709 0.0334397 0.0653965 -0.0051194 -0.005116 0.0093661 0.1508521 0.1005055 0.0489371 0.0047997 0.0613531 0.0040213 0.0357122 -0.0114412 0.0379443 0.0028653 -0.0149655 0.0085589 0.0032246 0.0104361 0.1226276 -0.0018683 0.0539528 -0.0043271 0.0675348 0.0866335 -0.058756 0.0039197 -0.0729405 0.014042 -0.0358325 -0.0113757 -0.036447 0.009417 0.010648 0.0919744 0.0002525 0.0625261 -0.0203562 -0.0017943 -0.0062448 -0.0011554 0.1590388 0.0522859 -0.0626716 0.0001863 -0.017131 0.0393363 0.00121 -0.0065775 0.0017005 0.1569986 -0.0102814 0.0205006 -0.0007958 0.1756156 -0.2361463 -0.0031062 -0.0028185 -0.0024979 0.1086229 unknown
polarizability: 177.1340894|1.6869679|117.8468695|-2.8691072|0.2199864|69.4717806 unknown
InChI: InChI=1S/C8H8O3S/c1-12(10,11)8-4-2-7(6-9)3-5-8/h2-6H,1H3
charge 0 multiplicity 1
20 atoms
S  2.587467 -0.073092 0.121195
O  3.124519 1.357921 0.704886
O  2.951907 -1.508847 0.814196
O  -4.349805 -0.650302 -0.046174
C  0.686286 0.043666 0.035124
C  0.1130 1.325077 0.041483
C  -0.051781 -1.154087 0.042809
C  3.143062 -0.176969 -1.710792
C  -2.080175 0.222299 0.001142
C  -1.296682 1.405952 0.021688
C  -1.457309 -1.055631 0.019545
C  -3.56646 0.333202 -0.022039
H  0.749774 2.214587 0.09346
H  0.461892 -2.119871 0.097607
H  2.803087 0.744393 -2.202921
H  4.23916 -0.24333 -1.66529
H  2.689679 -1.083931 -2.133331
H  -1.789884 2.385532 0.027399
H  -2.092291 -1.94804 0.023179
H  -3.959745 1.38087 -0.016269
