program: Gaussian 09
title: 000220375
version: EM64L-G09RevD.01
frameworkgroup: C1[X(C13H15NO5)]
method: RPBEPBE
basis: SDD
operation: Freq
keyword: #p
keyword: freq=noraman
keyword: PBEPBE/SDD
title: #p freq=noraman PBEPBE/SDD
converged: YES YES NO NO
title: Mulliken charges:
elementType: O O O O O N C C C C C C C C C C C C C H H H H H H H H H H H H H H H
charge: -0.273234 -0.197167 -0.231071 -0.195036 -0.221873 0.012475 -0.457422 -0.236565 -0.561930 0.445653 0.208538 0.229124 0.168220 -0.379694 -0.796181 -0.354399 -0.229056 -0.221047 -0.498954 0.253416 0.236902 0.257042 0.245594 0.268434 0.256531 0.258076 0.238426 0.290848 0.279746 0.237914 0.243780 0.241858 0.255574 0.225477
chargesum: 0.00000
title: Mulliken charges with hydrogens summed into heavy atoms:
elementType: O O O O O N C C C C C C C C C C C C C
charge: -0.273234 -0.197167 -0.231071 -0.195036 -0.221873 0.012475 0.032896 0.020477 -0.047902 0.445653 0.208538 0.229124 0.168220 -0.123163 -0.008830 -0.074653 0.008858 0.022733 0.223955
polarizability: 2.01937585e+02 -4.91757019e+00 1.91173762e+02 1.52852556e+00 2.98185843e+00 1.01551977e+02
1716.lowfreq: -13.3998 -6.7874 -1.1267 -0.0012 -0.0008 -0.0007 22.3506 27.8906 38.8883
frequency: 22.2332 27.5325 38.8660 53.0378 66.0257 80.8724 95.3571 104.5685 109.2587 117.0444 134.8122 147.8971 205.9299 209.2785 252.3795 261.2086 287.1601 310.3492 323.1635 350.4017 389.6955 424.7034 468.8345 506.5988 514.2697 532.4420 570.1610 592.6112 646.0665 666.6247 675.7873 697.7695 732.1802 763.1839 778.7390 786.0878 788.8629 818.3188 850.2601 888.9644 936.2866 947.1177 971.3723 981.4017 1000.3268 1006.4070 1022.7246 1050.0152 1065.2636 1084.8686 1112.7124 1125.5283 1148.3151 1156.1302 1166.7253 1177.5187 1200.5993 1207.4702 1217.3242 1233.2632 1276.2823 1293.2950 1302.3674 1314.4439 1345.0589 1362.7432 1378.2430 1389.2603 1421.4108 1434.5525 1447.0741 1450.9519 1455.8774 1463.8642 1468.5838 1471.6970 1484.2186 1577.7505 1609.2590 1623.0377 1648.2231 2984.4157 3005.8977 3007.9952 3018.7217 3030.4692 3065.3526 3069.3885 3094.6526 3113.4172 3123.9255 3132.8750 3149.0434 3150.0171 3166.0286 3184.6444
redmass: 5.8873 6.1042 5.7147 8.2693 4.0056 4.4577 3.0166 1.9738 3.4303 2.2069 1.2126 4.6346 3.7307 5.4398 3.5286 5.7526 3.2120 4.6922 3.5190 4.1916 4.7530 3.5592 4.8330 4.4979 3.9077 4.9454 3.8703 4.1519 6.7822 4.8664 5.0586 3.2945 3.6307 2.5327 4.6875 1.6847 2.1074 3.4103 3.7460 1.4713 2.9694 2.4502 1.4743 1.9670 1.3478 2.6064 2.3409 2.2049 3.5361 3.4488 1.2685 1.9467 1.4400 1.5571 2.1844 1.0969 1.7340 2.4497 5.4794 2.2102 1.3449 1.4011 1.3332 1.3813 1.4127 4.8607 1.2497 5.9075 1.1838 2.3470 1.0703 1.0497 1.0595 1.0516 1.1885 2.0901 1.1235 6.3715 6.7400 8.5229 9.0840 1.0372 1.0646 1.0291 1.0770 1.0593 1.1013 1.0965 1.1042 1.1047 1.0999 1.0877 1.1054 1.0912 1.0951 1.0979
irintensity: 1.2368 2.6489 1.1870 1.5065 10.0162 0.5382 0.9579 1.5228 0.1291 1.0522 0.0463 1.5927 1.6813 3.6608 2.3940 2.0571 6.8355 7.0815 5.5800 0.0911 3.1962 0.2776 4.1285 11.4936 7.0491 1.2977 4.8294 2.3617 7.0001 1.4596 21.1722 3.5358 21.8652 21.6419 5.3041 49.9847 11.2617 3.2433 3.6113 1.0728 4.7500 20.8531 5.7270 0.9507 1.4219 48.5380 7.7413 14.5378 15.6691 29.6359 0.1195 47.8977 11.5491 52.9179 8.5304 27.2929 68.2646 59.5056 124.1863 139.1067 5.9172 22.7054 0.9210 18.0519 0.6037 170.3685 67.1353 9.2733 17.9073 14.4739 24.7710 13.0737 16.9043 7.8455 0.2319 47.3257 7.7001 14.0572 17.8398 133.5739 189.6887 5.0466 7.8181 31.5666 9.7005 16.3643 5.6917 2.2407 10.9360 19.5763 8.4917 2.8846 14.5941 10.2032 12.1342 7.6807
temp: 298.150 k
press: 1.00000 atm
elementType: 8 8 8 8 8 7 6 6 6 6 6 6 6 6 6 6 6 6 6 1 1 1 1 1 1 1 1 1 1 1 1 1 1 1
symmnumber: 1
zpe: 685555.6 jmol-1
zpe.correction: 0.261114 hartree
zpe.thermalcorrener: 0.280499 hartree
zpe.thermalcorrenthalpy: 0.281443 hartree
zpe.thermalcorrgfe: 0.210629 hartree
zpe.sumelectzpe: -933.751113 hartree
zpe.sumelectthermal: -933.731728 hartree
zpe.sumelectthermalent: -933.730784 hartree
zpe.sumelectthermalfe: -933.801598 hartree
dipole: -2.4066 5.1132 -1.8327
dipole: 5.9410
quadrupole: -123.3443 -100.4625 -114.2547
quadrupole: -8.1206 1.2352 6.1702
quadrupole: -10.6571 12.2247 -1.5676 -8.1206 1.2352 6.1702
hfenergy: -934.0122273 hartree
pointgroup: C01 [X(C13H15N1O5)]
dipole: -1.1573067 1.9259177 -0.6440279 debye
polarizability: 202.8227166|-3.6634526|190.0386917|-0.7564722|5.7639087|101.8019159 unknown
InChI: InChI=1S/C13H15NO5/c1-9(15)11(13(16)19-2)8-7-10-5-3-4-6-12(10)14(17)18/h3-6,11H,7-8H2,1-2H3
charge 0 multiplicity 1
34 atoms
O  2.553705 1.893572 0.077079
O  3.075531 -1.218391 1.189906
O  4.420022 0.965301 -0.948975
O  -3.410268 -2.496741 0.263276
O  -1.260467 -2.308077 -0.450621
N  -2.385085 -1.788537 -0.072511
C  0.789132 -0.003932 -1.069546
C  2.317629 -0.305462 -0.959858
C  0.050603 0.107881 0.294895
C  -1.392465 0.547455 0.108601
C  2.585189 -1.45326 0.056954
C  3.213199 0.887646 -0.630973
C  -2.520514 -0.30983 -0.047311
C  -1.668737 1.941849 0.102625
C  2.187994 -2.848438 -0.392745
C  -3.842224 0.182136 -0.184474
C  -2.972706 2.452875 -0.058184
C  -4.069405 1.56879 -0.20017
C  3.409441 3.033239 0.495267
H  0.313627 -0.807054 -1.659763
H  0.663891 0.939665 -1.631326
H  2.660264 -0.662376 -1.950459
H  0.106799 -0.861542 0.817017
H  0.573533 0.856659 0.912903
H  -0.826313 2.630192 0.235462
H  2.443029 -3.580388 0.388795
H  2.707219 -3.114238 -1.332497
H  1.101086 -2.897646 -0.592993
H  -4.663514 -0.533309 -0.277752
H  -3.136367 3.535833 -0.063829
H  -5.086125 1.955781 -0.319069
H  3.821347 3.545563 -0.390226
H  4.238265 2.66752 1.122925
H  2.740381 3.694461 1.063678
