program: Gaussian 09
title: 000220371
version: EM64L-G09RevD.01
frameworkgroup: C1[X(C14H12ClNO2)]
method: RPBEPBE
basis: SDD
operation: Freq
keyword: #p
keyword: freq=noraman
keyword: PBEPBE/SDD
title: #p freq=noraman PBEPBE/SDD
converged: YES YES NO NO
title: Mulliken charges:
elementType: Cl O O N C C C C C C C C C C C C C C H H H H H H H H H H H H
charge: -0.079515 -0.208318 -0.210501 0.027602 -0.573264 -0.579127 0.530059 0.614348 -0.370588 -0.373856 -0.426974 -0.329909 -0.357146 -0.360921 0.370126 -0.216523 -0.239051 -0.234746 0.232002 0.247763 0.298532 0.256870 0.244787 0.235650 0.231937 0.285887 0.284972 0.233230 0.231450 0.235225
chargesum: 0.00000
title: Mulliken charges with hydrogens summed into heavy atoms:
elementType: Cl O O N C C C C C C C C C C C C C C
charge: -0.079515 -0.208318 -0.210501 0.027602 -0.093499 -0.280595 0.530059 0.614348 -0.113718 -0.129070 -0.191324 -0.097972 -0.071258 -0.075949 0.370126 0.016707 -0.007601 0.000479
polarizability: 2.73241551e+02 1.49746117e+01 1.55996314e+02 2.03421435e+01 -1.79223165e+01 1.09632525e+02
1716.lowfreq: -7.5275 -0.0014 -0.0013 -0.0011 3.4721 7.5806 15.3049 29.8355 34.0694
frequency: 15.1086 29.6313 33.9574 38.4297 67.1021 91.2091 125.1383 166.5195 186.4842 242.0898 258.4738 285.0574 355.9407 381.0855 401.3110 408.2777 409.5190 490.4648 506.7146 517.7004 571.3741 594.6486 618.6884 628.7326 641.6885 672.3165 699.6620 732.3452 762.6945 779.2440 812.2590 832.4541 849.0739 849.7783 880.6969 918.8832 931.6219 977.3115 985.6122 990.4023 993.1044 999.5817 1006.3589 1021.8927 1036.8796 1086.1116 1093.1422 1108.5180 1154.4210 1175.4470 1181.7219 1191.0096 1208.8038 1219.7124 1223.0999 1241.8849 1269.6915 1303.0597 1322.7354 1357.1366 1366.6441 1388.0883 1403.0231 1421.2187 1444.2900 1456.8831 1481.5472 1484.2265 1593.1390 1597.5942 1609.8164 1611.6603 2992.8313 3061.2426 3079.1214 3123.5459 3130.5888 3132.7786 3141.8657 3153.3320 3154.9581 3168.6568 3182.6455 3185.9753
redmass: 4.8754 5.6995 5.8354 7.2922 7.1145 6.8595 9.2874 6.2570 7.9045 4.8957 5.0243 6.8641 2.5050 6.9967 2.8094 2.8801 4.3223 4.0137 6.6943 3.2599 6.1361 4.0450 5.8992 6.9643 6.0115 4.5432 1.6749 4.4677 5.1570 2.2123 5.4214 2.3561 1.2541 1.2467 2.3712 1.5925 1.6689 1.3931 1.3636 5.7013 1.3805 1.3405 3.0918 2.8224 2.5987 1.5870 3.3179 1.3588 1.1105 1.0558 1.3310 1.1108 1.5430 2.5770 6.1928 1.6801 1.3365 1.2914 1.3767 1.5669 5.9745 5.7244 7.6287 3.2602 2.1086 1.1300 2.4594 2.3134 5.9770 7.6137 6.3753 6.0815 1.0631 1.0947 1.0908 1.0873 1.0864 1.0907 1.0914 1.0962 1.0905 1.1016 1.0943 1.0958
irintensity: 0.0395 0.2138 1.0032 1.3615 0.0235 1.3826 3.0004 1.7362 1.3475 1.7870 1.9193 1.2472 0.3740 3.6465 0.4825 0.1883 3.7025 14.4823 0.6941 22.9269 17.9763 42.7509 5.2293 2.9821 4.7172 32.4401 58.1638 5.2907 26.8760 33.4656 1.7291 22.2617 0.2979 0.3169 23.9924 16.5299 5.4772 0.1707 4.0386 1.0165 0.5092 0.0950 4.0861 13.6642 5.4799 15.8919 16.6507 9.9620 8.8768 0.3876 66.7416 3.5502 25.9595 38.6044 267.5588 25.2413 5.2136 1.6000 7.7418 8.4304 99.6186 0.7588 1.0159 43.8989 13.1177 7.1145 5.9375 7.4374 2.1092 2.3737 60.7603 0.4771 18.0561 0.9921 12.9183 5.8733 1.0312 10.8033 14.2238 33.2963 5.6142 20.0586 0.4684 4.1353
temp: 298.150 k
press: 1.00000 atm
elementType: 17 8 8 7 6 6 6 6 6 6 6 6 6 6 6 6 6 6 1 1 1 1 1 1 1 1 1 1 1 1
symmnumber: 1
zpe: 593944.0 jmol-1
zpe.correction: 0.226221 hartree
zpe.thermalcorrener: 0.242002 hartree
zpe.thermalcorrenthalpy: 0.242946 hartree
zpe.thermalcorrgfe: 0.179158 hartree
zpe.sumelectzpe: -1204.601350 hartree
zpe.sumelectthermal: -1204.585569 hartree
zpe.sumelectthermalent: -1204.584625 hartree
zpe.sumelectthermalfe: -1204.648413 hartree
dipole: -6.8458 -1.6839 -2.1714
dipole: 7.3766
quadrupole: -137.5992 -108.8453 -110.1450
quadrupole: 6.7619 -0.4403 -7.2349
quadrupole: -18.7360 10.0179 8.7182 6.7619 -0.4403 -7.2349
hfenergy: -1204.8275715 hartree
pointgroup: C01 [X(C14H12Cl1N1O2)]
dipole: -2.6975267 -0.6983548 -0.8114104 debye
polarizability: 273.4236238|15.3980615|152.9483783|19.4248395|-21.1561705|112.4983886 unknown
InChI: InChI=1S/C14H12ClNO2/c15-14(12-4-2-1-3-5-12)10-11-6-8-13(9-7-11)16(17)18/h1-9,14H,10H2
charge 0 multiplicity 1
30 atoms
Cl -1.20028 1.968581 1.127496
O  5.757139 0.939808 0.135276
O  5.576533 -1.281865 0.619253
N  5.071905 -0.148046 0.259189
C  -0.631489 0.053489 -0.871764
C  -1.504822 0.197138 0.396356
C  0.860432 0.009785 -0.587334
C  -2.986805 0.001549 0.190638
C  1.661998 1.175783 -0.695536
C  1.474472 -1.209442 -0.193386
C  -3.715617 -0.795253 1.110382
C  -3.674233 0.591559 -0.902674
C  3.042224 1.135486 -0.419959
C  2.851807 -1.272886 0.089908
C  3.618238 -0.092958 -0.029492
C  -5.101162 -1.009248 0.938166
C  -5.057987 0.380856 -1.074451
C  -5.776071 -0.421465 -0.155643
H  -0.945583 -0.889813 -1.36164
H  -0.86909 0.87546 -1.56935
H  -1.127281 -0.450144 1.203845
H  1.1953 2.121802 -0.98722
H  0.869093 -2.12061 -0.11786
H  -3.195918 -1.244341 1.965668
H  -3.132851 1.229513 -1.610005
H  3.673557 2.024322 -0.497797
H  3.340696 -2.20312 0.390623
H  -5.651761 -1.627263 1.655591
H  -5.579837 0.844415 -1.918809
H  -6.851406 -0.582393 -0.289572
