program: Gaussian 09
title: 000220373
version: EM64L-G09RevD.01
frameworkgroup: C1[X(C15H19NO6)]
method: RPBEPBE
basis: SDD
operation: Freq
keyword: #p
keyword: freq=noraman
keyword: PBEPBE/SDD
title: #p freq=noraman PBEPBE/SDD
converged: YES YES NO NO
title: Mulliken charges:
elementType: O O O O O O N C C C C C C C C C C C C C C C H H H H H H H H H H H H H H H H H H H
charge: -0.259540 -0.259982 -0.236517 -0.242281 -0.211439 -0.203515 0.012371 -0.427732 -0.306991 -0.579939 0.436252 0.266843 0.233099 0.166562 -0.377499 -0.355478 -0.229317 -0.221729 -0.264360 -0.262369 -0.661284 -0.663492 0.266719 0.235966 0.283834 0.253063 0.262397 0.269084 0.278425 0.237202 0.241510 0.222200 0.231938 0.235271 0.229696 0.211944 0.244615 0.249409 0.246680 0.228834 0.219549
chargesum: 0.00000
title: Mulliken charges with hydrogens summed into heavy atoms:
elementType: O O O O O O N C C C C C C C C C C C C C C C
charge: -0.259540 -0.259982 -0.236517 -0.242281 -0.211439 -0.203515 0.012371 0.074953 -0.023157 -0.064479 0.436252 0.266843 0.233099 0.166562 -0.108415 -0.077052 0.007886 0.019781 0.189778 0.202598 0.044684 0.031571
polarizability: 2.33367633e+02 3.91610483e+00 2.25210392e+02 3.06796272e+00 -5.01475194e+00 1.18164502e+02
1716.lowfreq: -12.3687 -11.1993 -2.0346 -0.0006 -0.0004 -0.0003 1.9122 25.9948 27.7701
frequency: -10.5489 25.9729 27.7242 34.6508 47.8879 52.0557 58.5134 73.6436 90.0889 95.7659 106.0675 124.7485 139.7587 146.1412 181.2453 205.5779 231.7564 254.7334 264.2070 278.5064 290.8450 314.2934 342.8183 352.1856 378.2611 401.1133 425.4245 439.8384 480.6126 509.7276 535.1505 559.8169 598.6431 648.0663 656.2709 673.8109 707.2883 724.0091 735.0244 760.4037 774.4267 786.0980 793.0931 802.3343 817.2838 824.0105 840.9469 860.3459 892.7224 910.8726 971.1178 983.2585 1001.0178 1005.8394 1011.4503 1023.7957 1051.4968 1066.2577 1082.7325 1093.8871 1095.6259 1116.8445 1136.9150 1149.7820 1154.8993 1157.8873 1173.0702 1188.5287 1207.3259 1217.3063 1229.4059 1269.4473 1273.7303 1278.4807 1293.2164 1305.7690 1323.3455 1347.5803 1354.5886 1357.7830 1362.2736 1388.5195 1389.5907 1394.8306 1434.2279 1457.1146 1457.9460 1460.8719 1461.7079 1462.7855 1471.2989 1477.1821 1482.9810 1484.2202 1577.4784 1609.4366 1633.1834 1637.1644 2993.1224 2997.7406 3010.3975 3028.6066 3029.2398 3031.6867 3034.1333 3076.1422 3088.8695 3091.9444 3094.9760 3098.9324 3099.2403 3122.1351 3123.8440 3133.5820 3149.0627 3164.8740 3183.6179
redmass: 4.5998 4.7270 4.8296 4.2363 5.2412 3.8547 4.8043 4.2857 4.5552 4.7540 5.9068 4.6431 3.9956 5.1728 2.0075 1.2953 1.6355 4.1377 3.4738 2.6807 3.2502 3.4006 5.4418 4.5733 4.6211 4.1529 3.5382 3.4409 4.3288 4.1069 5.3778 6.1647 5.4090 6.8984 3.3073 5.4761 4.0927 3.8266 3.8762 1.8975 4.2870 1.5932 1.6040 1.4361 1.7618 3.8244 2.9411 4.2653 1.4733 2.5220 1.5756 2.4528 1.3575 2.4277 2.6944 2.7784 2.1623 3.6933 3.9607 2.2434 2.1995 3.0203 1.8094 2.4342 1.6905 1.7264 1.1006 1.1184 3.0634 5.9849 1.8631 1.3955 1.1179 1.1245 1.3806 1.3722 1.4661 1.4037 1.4143 1.3872 3.3879 1.2367 5.8487 1.2304 2.3578 1.0948 1.0925 1.0976 1.0497 1.0446 2.3169 1.1381 1.0713 1.0522 6.3815 6.6849 8.8916 9.5831 1.0359 1.0371 1.0616 1.0676 1.0682 1.0641 1.0600 1.0997 1.0973 1.0984 1.1028 1.1034 1.1034 1.1068 1.1047 1.0876 1.0912 1.0955 1.0977
irintensity: 0.4424 1.4010 1.7115 1.5672 0.2933 1.7425 1.1625 0.4390 0.7243 1.0275 0.6410 5.7664 0.5138 0.6530 3.2517 3.4887 0.3935 3.6161 0.9842 3.3293 8.4106 6.2340 14.6460 5.4817 6.6523 2.4063 0.1011 5.0468 3.3887 9.9320 0.7634 5.3346 6.0891 5.1817 3.2140 16.3588 0.4761 13.8098 23.3122 7.2628 8.9245 49.7065 11.9305 7.1117 8.5039 1.6998 3.0582 3.0755 0.6258 11.0314 2.9796 1.2935 0.7774 9.1260 36.8405 86.1863 53.2225 29.5132 44.2544 37.1796 44.9443 235.7812 6.3927 254.6954 20.1310 55.0912 4.0680 10.3528 102.2482 143.2395 66.0408 33.1659 4.8174 8.2895 26.6430 15.7962 74.7263 11.9081 10.1554 21.7705 110.6176 22.4371 11.4847 18.9941 12.3157 9.2934 5.9089 10.5713 21.5484 14.2276 43.5022 12.7863 29.8641 11.8343 15.6008 18.2585 128.1014 173.3338 20.0681 14.6819 10.2184 28.2641 12.3059 12.5826 27.4383 1.1343 34.5838 33.1171 1.9046 16.9814 2.5981 29.9691 28.6608 1.8034 8.5888 13.3303 8.2454
temp: 298.150 k
press: 1.00000 atm
elementType: 8 8 8 8 8 8 7 6 6 6 6 6 6 6 6 6 6 6 6 6 6 6 1 1 1 1 1 1 1 1 1 1 1 1 1 1 1 1 1 1 1
symmnumber: 1
zpe: 845712.7 jmol-1
zpe.correction: 0.322115 hartree
zpe.thermalcorrener: 0.344133 hartree
zpe.thermalcorrenthalpy: 0.345077 hartree
zpe.thermalcorrgfe: 0.268209 hartree
zpe.sumelectzpe: -1087.358901 hartree
zpe.sumelectthermal: -1087.336883 hartree
zpe.sumelectthermalent: -1087.335939 hartree
zpe.sumelectthermalfe: -1087.412807 hartree
dipole: 1.6924 -3.0050 -1.4125
dipole: 3.7269
quadrupole: -114.1981 -117.2854 -132.6311
quadrupole: 12.1052 0.4485 -0.2417
quadrupole: 7.1735 4.0861 -11.2596 12.1052 0.4485 -0.2417
hfenergy: -1087.6810162 hartree
pointgroup: C01 [X(C15H19N1O6)]
dipole: -0.5989023 1.2360542 -0.5132647 debye
polarizability: 233.7563807|3.385482|224.1304501|0.5480134|10.3949497|118.8556954 unknown
InChI: InChI=1S/C15H19NO6/c1-3-21-14(17)12(15(18)22-4-2)10-9-11-7-5-6-8-13(11)16(19)20/h5-8,12H,3-4,9-10H2,1-2H3
charge 0 multiplicity 1
41 atoms
O  -1.778091 -2.380729 -1.079123
O  -3.817655 0.786446 -0.250065
O  -2.02095 -1.473198 1.059557
O  -2.016241 2.194997 0.202339
O  2.094452 -1.84458 -0.603935
O  4.264886 -1.915296 0.071405
N  3.17726 -1.268402 -0.190075
C  -0.146976 0.352784 -1.015044
C  -1.657733 -0.000939 -0.909181
C  0.594953 0.374059 0.351278
C  1.994891 0.948527 0.208205
C  -1.860247 -1.330433 -0.173248
C  -2.470092 1.117753 -0.248574
C  3.189097 0.207219 -0.027498
C  2.150997 2.356026 0.334762
C  4.463857 0.82019 -0.116206
C  3.406668 2.987223 0.225819
C  4.572951 2.216058 0.001137
C  -1.807022 -3.768261 -0.506638
C  -4.760189 1.764959 0.38043
C  -0.42791 -4.171767 0.020097
C  -5.216819 2.808929 -0.641717
H  0.341169 -0.379224 -1.680765
H  -0.071968 1.351749 -1.483017
H  -2.055063 -0.135539 -1.932547
H  0.618875 -0.645433 0.767691
H  0.028165 1.015622 1.047291
H  1.253359 2.953971 0.529671
H  5.341615 0.188514 -0.276229
H  3.478705 4.075799 0.323622
H  5.552618 2.697411 -0.079078
H  -2.123252 -4.383545 -1.363814
H  -2.572566 -3.797668 0.288906
H  -4.250769 2.234207 1.239984
H  -5.590679 1.131314 0.729229
H  -0.441877 -5.240895 0.302814
H  -0.156554 -3.583592 0.912079
H  0.351785 -4.022329 -0.745118
H  -4.36942 3.433665 -0.970484
H  -5.670275 2.325218 -1.523976
H  -5.975058 3.470389 -0.183084
