program: Gaussian 09
title: 000220362
version: EM64L-G09RevD.01
frameworkgroup: C1[X(C11H20O4)]
method: RPBEPBE
basis: SDD
operation: Freq
keyword: #pfreq=noraman
keyword: PBEPBE/SDD
title: #p freq=noraman PBEPBE/SDD
converged: YES YES NO NO
title: Mulliken charges:
elementType: O O O O C C C C C C C C C C C H H H H H H H H H H H H H H H H H H H H
charge: -0.421161 -0.417291 -0.242613 -0.242044 0.384366 -0.454043 -0.400231 -0.582224 -0.567297 -0.768918 -0.349001 -0.359323 0.172159 0.173243 -0.696347 0.187129 0.242171 0.204421 0.196220 0.250644 0.309301 0.262758 0.258434 0.261576 0.236762 0.199921 0.186724 0.194803 0.196461 0.193214 0.216004 0.210024 0.211703 0.374466 0.377990
chargesum: 0.00000
title: Mulliken charges with hydrogens summed into heavy atoms:
elementType: O O O O C C C C C C C C C C C
charge: -0.046695 -0.039302 -0.242613 -0.242044 0.384366 -0.024744 0.000411 -0.022280 -0.046105 -0.070659 0.032526 0.030352 0.172159 0.173243 -0.058616
polarizability: 1.46495279e+02 -5.59918547e+00 1.32767453e+02 -1.64414613e+00 -1.11563357e+00 1.13159319e+02
1716.lowfreq: -0.0002 0.0002 0.0007 2.8259 8.5106 10.2548 23.4464 27.9753 37.8689
frequency: 23.1659 27.9145 37.8337 58.3523 68.6417 85.8538 101.8665 121.0829 132.8257 152.1014 194.2432 214.3631 226.1539 241.8929 267.7959 278.1382 306.6466 326.6515 345.4933 392.1406 464.9672 481.8447 509.6139 512.5590 522.5219 594.8687 642.8727 654.2442 655.7225 725.9681 749.0871 775.1028 830.8634 857.6489 868.5753 886.5554 908.0798 913.5085 943.1147 954.3344 980.8962 1014.8717 1043.3841 1050.8233 1063.2118 1076.5171 1083.3587 1103.0306 1124.7083 1166.4349 1185.4480 1208.9727 1230.5461 1243.3069 1251.2303 1264.6251 1274.5458 1287.1245 1295.0644 1311.6225 1316.9880 1352.3921 1353.1795 1357.0106 1364.6396 1388.6002 1395.4574 1429.0996 1444.7578 1464.4844 1465.1147 1472.4987 1475.7844 1478.6332 1482.9406 1489.5845 1497.6530 1658.7457 1663.2384 2954.1312 2957.4664 2965.7315 2969.7734 2972.6288 2982.8488 2985.2506 2992.2581 2993.6691 3007.7790 3029.2504 3045.4234 3046.6054 3049.3162 3069.1155 3071.7512 3075.9811 3102.3957 3506.4001 3506.6246
redmass: 6.4933 7.7478 5.1543 1.9753 3.3524 3.9594 3.1962 2.3721 2.2503 3.1018 4.9907 2.1597 1.3364 1.1352 3.6059 3.6612 2.5731 3.0983 3.1392 2.5858 2.5255 2.5316 2.3350 2.6393 2.6486 3.4726 2.3161 1.4643 1.8197 1.0761 1.2248 3.1520 1.3993 3.1523 2.8645 2.0826 1.9044 2.9073 1.7350 1.7564 1.4784 3.6845 2.3534 2.0913 2.5174 2.4405 1.3470 2.1350 2.1540 1.7026 2.0082 1.4761 1.3661 1.3354 1.5889 1.6048 1.7122 1.2048 1.1203 1.3569 1.3446 1.8089 1.5533 1.7035 1.6177 1.2167 1.2173 1.0906 1.0835 1.0724 1.0730 1.0650 1.0432 1.0629 1.0756 1.0913 1.0569 7.6574 7.6854 1.0588 1.0597 1.0624 1.0618 1.0363 1.0407 1.0598 1.0884 1.0684 1.0994 1.1018 1.0977 1.0994 1.0965 1.1006 1.0994 1.0977 1.0994 1.0639 1.0638
irintensity: 0.4522 0.3625 0.7221 0.3469 0.3002 0.7675 0.9241 0.1723 0.1357 1.4708 1.4920 0.7389 0.1950 0.0631 0.7491 0.7852 1.0595 5.4989 2.4858 1.0897 1.0788 12.2055 37.4287 49.5588 23.7121 2.7127 71.4803 112.6920 101.9973 11.8492 0.2522 3.4442 7.3326 2.8999 2.2255 11.4878 1.3157 15.4559 36.4007 31.3541 60.2121 11.0039 121.5244 357.8552 15.5820 10.9839 3.8422 13.4395 9.9813 18.7142 3.7680 1.9954 2.5344 1.6624 2.5486 10.2206 3.0041 0.5500 0.0645 6.2670 4.6467 83.5684 8.9815 52.2414 29.5571 11.5060 34.9618 19.6326 30.9402 1.5114 0.1669 2.1954 12.7557 7.6382 10.3663 24.8070 19.8812 192.9324 172.6737 0.8844 5.0397 4.8054 108.7030 40.3428 42.1908 13.8031 1.6161 16.2627 2.9255 25.0430 7.0843 65.2575 12.6402 87.7278 53.3893 30.2421 10.8946 31.4356 14.4331
temp: 298.150 k
press: 1.00000 atm
elementType: 8 8 8 8 6 6 6 6 6 6 6 6 6 6 6 1 1 1 1 1 1 1 1 1 1 1 1 1 1 1 1 1 1 1 1
symmnumber: 1
zpe: 778470.7 jmol-1
zpe.correction: 0.296504 hartree
zpe.thermalcorrener: 0.314572 hartree
zpe.thermalcorrenthalpy: 0.315516 hartree
zpe.thermalcorrgfe: 0.248307 hartree
zpe.sumelectzpe: -730.873506 hartree
zpe.sumelectthermal: -730.855438 hartree
zpe.sumelectthermalent: -730.854494 hartree
zpe.sumelectthermalfe: -730.921702 hartree
dipole: -0.6644 -1.6818 -0.9242
dipole: 2.0308
quadrupole: -91.9307 -88.6131 -95.2797
quadrupole: -6.9012 0.6072 -3.4132
quadrupole: 0.0105 3.3280 -3.3386 -6.9012 0.6072 -3.4132
hfenergy: -731.1700095 hartree
pointgroup: C01 [X(C11H20O4)]
dipole: 0.2792333 0.6594407 -0.3542658 debye
polarizability: 146.0644437|-6.1478958|133.1890329|0.6410516|1.7335944|113.1685742 unknown
InChI: InChI=1S/C11H20O4/c1-3-4-5-6-11(2,7-9(12)13)8-10(14)15/h12,14H,3-8H2,1-2H3
charge 0 multiplicity 1
35 atoms
O  -0.406897 -3.090908 -1.458989
O  -3.124189 2.952831 -0.317535
O  -0.171854 -2.906962 0.835643
O  -3.611991 0.696561 -0.470812
C  -0.831647 0.059753 0.622355
C  0.681889 0.171768 1.005683
C  1.683753 0.434043 -0.143323
C  -1.065367 -0.994029 -0.502429
C  -1.298415 1.453291 0.100864
C  -1.632409 -0.312229 1.900862
C  3.13912 0.545144 0.36821
C  4.168505 0.772592 -0.761965
C  -0.505371 -2.377693 -0.249044
C  -2.76934 1.595606 -0.246064
C  5.618055 0.886758 -0.24253
H  0.780839 0.982045 1.758511
H  0.969544 -0.765047 1.519675
H  1.632869 -0.385644 -0.888623
H  1.428003 1.368104 -0.685644
H  -0.657074 -0.645846 -1.468941
H  -2.15609 -1.10377 -0.664013
H  -1.061401 2.228768 0.853332
H  -0.732421 1.737666 -0.809579
H  -1.276087 -1.27419 2.304905
H  -2.711792 -0.403601 1.686927
H  -1.496358 0.462284 2.67956
H  3.208896 1.376816 1.10042
H  3.402291 -0.379294 0.923237
H  4.100234 -0.062047 -1.489418
H  3.901149 1.693371 -1.32022
H  6.333478 1.04744 -1.069922
H  5.721428 1.733062 0.462628
H  5.920904 -0.033199 0.292273
H  -0.080659 -4.011524 -1.262579
H  -4.084394 3.024676 -0.573858
