program: Gaussian 09
title: 000220381
version: EM64L-G09RevD.01
frameworkgroup: C1[X(C17H23NO6)]
method: RPBEPBE
basis: SDD
operation: Freq
keyword: #p
keyword: freq=noraman
keyword: PBEPBE/SDD
title: #p freq=noraman PBEPBE/SDD
converged: YES YES NO NO
title: Mulliken charges:
elementType: O O O O O O N C C C C C C C C C C C C C C C C C H H H H H H H H H H H H H H H H H H H H H H H
charge: -0.260956 -0.273611 -0.249585 -0.244405 -0.213645 -0.202649 0.012808 0.109706 -0.450178 -0.382152 -0.591302 0.212276 0.215914 0.442407 -0.711400 0.162054 -0.377805 -0.267540 -0.261386 -0.357612 -0.231593 -0.222517 -0.658863 -0.666182 0.256508 0.238895 0.230766 0.207431 0.244620 0.271547 0.226069 0.208847 0.239295 0.267696 0.223389 0.232924 0.217390 0.243352 0.277704 0.237007 0.241426 0.242648 0.244456 0.212859 0.222094 0.271479 0.209813
chargesum: 0.00000
title: Mulliken charges with hydrogens summed into heavy atoms:
elementType: O O O O O O N C C C C C C C C C C C C C C C C C
charge: -0.260956 -0.273611 -0.249585 -0.244405 -0.213645 -0.202649 0.012808 0.109706 0.045225 0.056045 -0.075135 0.212276 0.215914 0.442407 -0.037189 0.162054 -0.110109 0.188773 0.199356 -0.079908 0.005414 0.018909 0.041101 0.037204
polarizability: 2.53279777e+02 -8.15153640e+00 2.39264043e+02 3.31028064e+00 -8.56507883e+00 1.53399953e+02
1716.lowfreq: -5.4438 -3.3292 -0.0006 0.0004 0.0008 8.8476 17.4864 23.8870 29.4602
frequency: 17.3635 23.6897 29.4370 33.6525 46.4428 53.3452 57.1405 75.0131 84.5618 90.4511 102.9365 106.6281 125.0524 133.4537 152.0151 169.1350 187.9016 198.8444 210.1859 233.9832 251.1253 258.0337 267.2690 301.2759 301.6126 336.2570 339.5928 355.5373 361.1713 390.3183 420.6332 425.6265 436.5605 485.4526 504.8267 531.8082 541.8680 597.9126 648.5630 649.7716 673.6747 704.4284 715.7915 740.4892 742.4932 760.1256 773.0630 774.6591 785.9702 808.8326 818.9344 820.5619 827.2553 845.8791 891.3499 912.8594 943.4561 971.7472 989.7553 999.6460 1006.0695 1010.3732 1016.6649 1046.6056 1062.0179 1067.2669 1081.6074 1092.2090 1096.7322 1100.6414 1105.9794 1132.3536 1156.0696 1157.9383 1163.7248 1175.7584 1183.6858 1207.6006 1218.3507 1227.9793 1271.2847 1271.8568 1274.4373 1284.7136 1298.5530 1324.2729 1332.5607 1348.0869 1353.0906 1357.2358 1361.9421 1390.3084 1390.8976 1393.4528 1401.1663 1434.3155 1445.5719 1456.9036 1461.1708 1462.1217 1463.6397 1470.6162 1471.3770 1472.1693 1478.0128 1483.8899 1484.3447 1488.3960 1577.4183 1609.2052 1613.7263 1621.3804 2988.4636 2992.9451 2994.4088 2995.6308 3007.7044 3027.0536 3029.1929 3031.7091 3053.7206 3073.0265 3083.9166 3084.6643 3091.4496 3093.0468 3096.8440 3103.0395 3104.1006 3117.1018 3122.0329 3132.7915 3148.5669 3164.6945 3183.7724
redmass: 6.2972 3.4370 3.1904 5.4356 5.6674 3.3436 5.2333 3.8699 3.3960 3.5759 3.2304 4.6763 4.7137 4.2672 2.4324 2.6217 2.1851 1.6102 1.3691 2.5005 1.7216 5.7232 2.4895 2.8171 2.9282 3.7482 4.4114 4.1916 4.9903 4.8942 3.7243 3.6612 3.4317 4.5745 4.1520 4.4300 4.8960 5.0369 6.7204 2.9277 5.3928 4.3891 4.0379 3.0084 4.0876 1.9780 1.3543 4.6943 1.5252 1.7397 1.9109 1.3703 3.4514 3.3275 1.4907 2.1862 3.0854 1.4015 2.4218 1.3646 2.4151 2.5637 2.2034 2.1938 4.2855 3.1981 3.0044 3.0108 2.3880 2.2509 3.0082 1.9602 1.6930 1.6554 1.6893 1.5460 1.7672 3.0645 5.3739 1.8231 1.1709 1.2269 1.1242 1.2995 1.3723 1.3582 1.3489 1.2848 1.4391 1.6319 2.7261 5.1414 1.2519 1.2107 1.2210 2.3280 1.0924 1.1001 1.0509 1.0810 1.0472 1.1620 2.0433 1.0518 1.1504 1.0541 1.0503 1.0544 6.3893 6.6689 9.0974 9.6344 1.0583 1.0366 1.0402 1.0363 1.0589 1.0580 1.0596 1.0612 1.0993 1.1004 1.0980 1.1002 1.0985 1.1028 1.1023 1.1023 1.1009 1.1044 1.1055 1.0878 1.0912 1.0955 1.0976
irintensity: 1.3364 0.5967 0.1411 1.5855 1.8031 0.9895 1.6361 0.6196 1.3426 0.0560 0.1878 0.6646 4.2219 2.9333 1.4732 0.3450 0.5938 3.2518 1.9179 1.3922 0.4599 3.2066 2.1329 5.1947 8.9745 10.2609 1.9621 1.9231 10.7196 4.6096 2.1678 0.1554 5.3875 5.0213 12.6375 1.7065 3.0190 3.1014 5.8335 1.3385 16.0453 3.1478 6.6197 18.4120 15.6021 11.1445 3.9834 7.6344 51.8853 2.9122 8.9232 3.7072 1.4824 5.0020 0.4920 17.0447 3.6215 4.0374 0.8689 0.6280 34.6794 39.5467 79.8680 9.3539 8.8682 12.1959 223.0425 59.5864 36.1654 15.5550 106.4066 28.5624 14.9404 5.0589 47.3293 82.0837 122.6495 87.8163 133.4582 63.2822 1.0004 6.1132 7.3093 19.4948 4.9740 14.0856 32.1710 1.3396 19.9063 33.8705 105.3315 8.3298 28.2653 13.2439 16.6359 11.7453 1.1401 26.4646 4.7761 13.8684 12.6945 1.3634 53.7440 13.7288 11.2159 9.6241 13.5544 22.4586 16.6830 30.4608 149.4439 145.9157 28.8470 22.2623 30.8841 16.6665 12.8578 40.1916 34.3633 10.7134 5.0491 3.2694 35.0585 23.8059 30.4907 10.7537 6.5949 0.5431 40.9932 18.6811 29.5030 2.1357 8.7618 13.8977 8.1756
temp: 298.150 k
press: 1.00000 atm
elementType: 8 8 8 8 8 8 7 6 6 6 6 6 6 6 6 6 6 6 6 6 6 6 6 6 1 1 1 1 1 1 1 1 1 1 1 1 1 1 1 1 1 1 1 1 1 1 1
symmnumber: 1
zpe: 990597.9 jmol-1
zpe.correction: 0.377299 hartree
zpe.thermalcorrener: 0.403120 hartree
zpe.thermalcorrenthalpy: 0.404064 hartree
zpe.thermalcorrgfe: 0.318289 hartree
zpe.sumelectzpe: -1165.803610 hartree
zpe.sumelectthermal: -1165.777789 hartree
zpe.sumelectthermalent: -1165.776845 hartree
zpe.sumelectthermalfe: -1165.862619 hartree
dipole: -1.0579 -2.4641 1.6325
dipole: 3.1395
quadrupole: -126.1795 -133.7841 -143.8159
quadrupole: -12.5315 7.5949 3.1204
quadrupole: 8.4137 0.8090 -9.2227 -12.5315 7.5949 3.1204
hfenergy: -1166.1809085 hartree
pointgroup: C01 [X(C17H23N1O6)]
dipole: 0.1073813 1.064269 0.6175877 debye
polarizability: 256.0488457|-4.7070619|236.7729402|6.669732|3.8040959|153.1219867 unknown
InChI: InChI=1S/C17H23NO6/c1-4-17(15(19)23-5-2,16(20)24-6-3)12-11-13-9-7-8-10-14(13)18(21)22/h7-10H,4-6,11-12H2,1-3H3
charge 0 multiplicity 1
47 atoms
O  3.096183 1.902741 0.106551
O  2.290993 -1.79333 0.806671
O  1.010243 2.844681 0.515788
O  2.036378 -0.5460 -1.14693
O  -1.498919 -2.335113 -0.172668
O  -3.482126 -2.931576 -1.112574
N  -2.700724 -2.059052 -0.567328
C  1.388587 0.445799 1.028142
C  -0.174056 0.29926 1.0062
C  1.845904 0.314005 2.52503
C  -0.84008 0.419904 -0.392576
C  1.772997 1.847412 0.511801
C  1.963828 -0.640917 0.100044
C  -2.355433 0.441878 -0.271699
C  3.358442 0.409639 2.807555
C  -3.222648 -0.68533 -0.364788
C  -2.989442 1.697609 -0.064883
C  3.577172 3.197456 -0.474308
C  2.675365 -3.008079 0.01351
C  -4.63282 -0.575202 -0.276662
C  -4.388419 1.825564 0.050166
C  -5.218425 0.683198 -0.058942
C  3.228626 3.269479 -1.96321
C  1.544571 -4.035567 0.085301
H  -0.433897 -0.678611 1.448662
H  -0.575207 1.095562 1.660114
H  1.47368 -0.662803 2.883201
H  1.308452 1.0978 3.095132
H  -0.5225 1.372237 -0.851128
H  -0.495424 -0.400336 -1.040185
H  3.776189 1.389138 2.519679
H  3.541566 0.263906 3.888088
H  3.91237 -0.372202 2.261118
H  -2.352182 2.586953 0.000406
H  4.664714 3.165222 -0.302684
H  3.122479 4.028718 0.092992
H  3.59848 -3.36961 0.496854
H  2.887893 -2.692546 -1.022479
H  -5.238926 -1.479263 -0.379096
H  -4.832636 2.81291 0.216284
H  -6.30602 0.774374 0.023076
H  3.6112 2.382904 -2.49608
H  2.136983 3.324375 -2.108656
H  3.684094 4.173179 -2.409174
H  1.326303 -4.310469 1.131777
H  0.61879 -3.647714 -0.370657
H  1.845298 -4.951687 -0.456933
