program: Gaussian 09
title: 000220384
version: EM64L-G09RevD.01
frameworkgroup: C1[X(C18H25NO5)]
method: RPBEPBE
basis: SDD
operation: Freq
keyword: #p
keyword: freq=noraman
keyword: PBEPBE/SDD
title: #p freq=noraman PBEPBE/SDD
converged: YES YES NO NO
title: Mulliken charges:
elementType: O O O O O N C C C C C C C C C C C C C C C C C C H H H H H H H H H H H H H H H H H H H H H H H H H
charge: -0.287369 -0.193519 -0.222257 -0.212187 -0.212564 0.026961 0.169007 -0.433379 -0.467286 -0.376320 -0.583400 0.169277 0.192188 -0.348410 0.531547 -0.801408 -0.698970 -0.427465 -0.364322 -0.262852 -0.354179 -0.367786 0.367512 -0.663438 0.203886 0.215910 0.212796 0.259856 0.192703 0.231979 0.250475 0.231394 0.190662 0.195989 0.252807 0.261002 0.239191 0.212545 0.217629 0.216163 0.246570 0.258370 0.219946 0.238582 0.284309 0.283290 0.262383 0.221446 0.220736
chargesum: 0.00000
title: Mulliken charges with hydrogens summed into heavy atoms:
elementType: O O O O O N C C C C C C C C C C C C C C C C C C
charge: -0.287369 -0.193519 -0.222257 -0.212187 -0.212564 0.026961 0.169007 -0.013583 0.005366 0.048361 -0.101531 0.169277 0.192188 0.038241 0.531547 -0.048407 -0.052633 -0.180895 -0.105952 0.195676 -0.069869 -0.084497 0.367512 0.041127
polarizability: 2.95123949e+02 -2.61881745e+00 2.00807378e+02 -1.59495112e+01 -2.19444523e+01 1.81072778e+02
1716.lowfreq: -11.1416 -4.0973 -0.0008 -0.0004 0.0003 4.4552 12.1300 14.1230 16.5512
frequency: 8.9599 13.7718 16.4802 26.3923 43.7248 48.6320 59.7712 66.8713 71.3168 77.8146 98.3863 108.4019 116.0866 135.8802 145.8847 165.1175 179.1907 200.7461 210.1266 224.8089 236.4985 242.2458 255.2880 263.6513 311.5053 322.9472 330.2946 338.4755 359.6821 381.3091 408.5279 429.6120 431.5669 484.5247 503.6563 508.4994 539.1280 580.1011 608.5929 628.1053 650.2510 672.5467 693.7254 716.9434 730.9089 738.0455 747.3112 764.1044 778.6649 807.5544 816.4950 823.7603 852.3116 863.3467 872.2242 896.0534 929.1260 958.2336 964.0431 987.3531 995.5470 1000.9915 1006.4584 1008.9294 1027.0180 1039.5831 1066.9212 1074.8791 1085.9488 1092.8223 1094.9968 1099.3490 1104.7759 1124.5054 1146.9877 1154.1471 1175.4217 1179.4228 1204.2148 1218.7432 1223.0182 1247.5755 1261.5234 1276.3296 1277.9733 1287.4375 1290.1417 1303.3395 1323.0536 1328.6260 1348.0175 1351.9723 1361.7471 1365.5136 1372.4223 1391.9492 1392.9202 1403.3979 1421.6567 1439.3112 1450.9185 1455.4325 1460.6347 1463.2616 1467.5753 1470.3275 1472.5416 1476.7193 1479.7322 1480.4464 1484.9713 1489.9756 1594.8133 1607.3734 1608.7369 1644.5207 2958.8383 2971.0108 2975.7268 2986.9285 2987.2830 2991.8653 2993.5693 3005.3958 3008.8713 3019.7781 3030.4753 3054.1510 3057.4991 3072.1556 3072.7557 3075.4435 3075.8540 3086.5141 3095.4620 3119.8398 3121.9411 3136.4802 3139.1407 3180.0967 3182.7733
redmass: 4.7702 5.2202 4.5088 4.6277 2.1922 2.4091 3.5825 6.9507 3.4759 3.9378 4.8537 4.7462 4.2645 4.2826 1.1155 2.8688 3.3182 1.8235 3.9086 1.1731 2.6962 3.0004 2.5774 2.5576 2.9560 3.5284 3.3941 4.6060 3.2251 6.8139 2.9009 3.2665 3.2161 3.8458 4.7845 5.5945 3.3924 3.5244 4.4214 6.8881 4.0249 4.2840 3.3641 1.4112 2.7556 3.1671 1.9144 2.0809 2.2065 1.7782 1.6694 3.1804 1.2885 1.8449 2.0397 1.8055 1.4866 1.7533 3.5199 1.3735 1.3663 2.1606 3.0026 2.3562 2.0486 3.3123 4.0787 3.0220 2.6981 3.2511 2.5340 2.1406 1.3156 2.7706 1.6360 1.6691 2.2266 1.3467 1.5320 2.6830 6.4283 1.5625 1.3601 1.1218 1.1733 1.3428 1.1165 1.2897 1.3546 1.3599 1.4620 1.2838 1.6979 3.8995 1.2490 1.2132 1.2289 7.7125 3.1036 1.0783 1.0716 1.0943 1.0794 1.0439 1.0794 1.0842 1.0903 1.0426 1.2061 1.8884 1.0511 1.0915 7.6644 7.1376 7.7800 9.7837 1.0593 1.0593 1.0364 1.0400 1.0650 1.0616 1.0363 1.0951 1.0601 1.0993 1.0590 1.0971 1.1011 1.0975 1.0987 1.0999 1.1022 1.0983 1.1030 1.1057 1.1000 1.0905 1.0907 1.0942 1.0952
irintensity: 0.5155 2.6542 0.5948 0.9840 1.3377 0.2075 0.1305 0.0999 2.9242 1.9426 1.3978 1.2826 2.7741 0.2721 0.0432 0.0298 2.7305 0.9764 1.6972 0.0275 1.0163 0.3680 0.3015 0.4941 4.0774 1.8866 3.1920 10.0685 1.6844 4.9877 0.0310 1.7010 0.0597 6.0291 6.1375 7.0782 8.7008 2.0265 0.9229 0.9347 9.3477 26.6615 9.3216 10.8310 7.0018 2.0659 12.0856 8.8993 13.3626 1.6859 2.4637 12.3360 0.3930 13.8743 26.3646 9.0385 31.3207 17.2610 0.7334 3.6435 0.2773 5.2468 7.7107 21.9394 88.1776 12.9485 72.3939 15.2447 27.2431 31.1376 72.8811 66.1614 13.8272 5.4671 61.0159 2.6436 26.0742 64.3610 14.6833 1.6409 357.2343 33.0263 13.1045 1.7972 2.2573 2.2088 4.1808 1.2423 18.7872 7.0782 2.3662 0.1040 14.4931 80.7151 75.1282 12.2020 26.8590 0.1905 38.2966 22.2610 5.5746 11.4102 15.2017 16.2733 0.4249 5.1316 6.2706 12.6769 0.5788 16.3480 15.0381 20.1905 1.8914 145.7867 31.4947 172.6259 26.3050 16.1907 33.1206 0.6300 24.4340 38.1918 14.8074 18.9596 15.9654 6.6520 29.4559 0.2485 20.5457 23.0981 66.9864 37.9489 43.4004 34.3520 5.0955 27.3887 9.0927 10.6437 7.5308 0.2399 3.3363
temp: 298.150 k
press: 1.00000 atm
elementType: 8 8 8 8 8 7 6 6 6 6 6 6 6 6 6 6 6 6 6 6 6 6 6 6 1 1 1 1 1 1 1 1 1 1 1 1 1 1 1 1 1 1 1 1 1 1 1 1 1
symmnumber: 1
zpe: 1049860.7 jmol-1
zpe.correction: 0.399871 hartree
zpe.thermalcorrener: 0.426301 hartree
zpe.thermalcorrenthalpy: 0.427245 hartree
zpe.thermalcorrgfe: 0.337898 hartree
zpe.sumelectzpe: -1129.873078 hartree
zpe.sumelectthermal: -1129.846648 hartree
zpe.sumelectthermalent: -1129.845704 hartree
zpe.sumelectthermalfe: -1129.935051 hartree
dipole: -5.0087 -0.9752 -1.2586
dipole: 5.2557
quadrupole: -200.1793 -127.9482 -150.1786
quadrupole: 11.3966 19.3760 -9.0425
quadrupole: -40.7439 31.4872 9.2567 11.3966 19.3760 -9.0425
hfenergy: -1130.2729487 hartree
pointgroup: C01 [X(C18H25N1O5)]
dipole: -1.9671642 -0.3204551 -0.5506079 debye
polarizability: 293.6171378|8.0337892|213.2952974|-18.0527462|-11.763013|170.0916695 unknown
InChI: InChI=1S/C18H25NO5/c1-4-6-12-18(14(3)20,17(21)24-5-2)13-11-15-7-9-16(10-8-15)19(22)23/h7-10H,4-6,11-13H2,1-3H3
charge 0 multiplicity 1
49 atoms
O  -1.470221 2.019068 0.105185
O  -2.214904 -0.94711 2.389298
O  -3.509607 1.357509 1.005557
O  6.765444 -0.599728 -0.993466
O  6.205346 1.453163 -1.81493
N  5.919821 0.357227 -1.191812
C  -2.028373 -0.364528 0.015877
C  -2.862513 -0.716233 -1.267906
C  -0.508776 -0.482964 -0.360722
C  -4.40266 -0.647867 -1.15534
C  0.494264 -0.293796 0.812357
C  -2.278922 -1.346153 1.19902
C  -2.426062 1.058106 0.461055
C  -5.090606 -1.161632 -2.44188
C  1.917261 -0.130966 0.30564
C  -2.480385 -2.822261 0.876893
C  -6.629825 -1.071423 -2.369853
C  2.891067 -1.146231 0.496393
C  2.29436 1.052126 -0.389277
C  -1.797755 3.438386 0.465106
C  4.205254 -0.998462 0.009892
C  3.600429 1.222984 -0.881201
C  4.541639 0.188534 -0.67595
C  -1.374778 3.739633 1.905054
H  -2.567856 -1.736689 -1.585434
H  -2.527958 -0.038183 -2.079523
H  -0.340444 -1.472213 -0.830532
H  -0.305027 0.277207 -1.134946
H  -4.756123 -1.242957 -0.289357
H  -4.725594 0.389452 -0.952569
H  0.198986 0.605534 1.382416
H  0.436112 -1.14878 1.509429
H  -4.789259 -2.213442 -2.628403
H  -4.725601 -0.576373 -3.311044
H  -3.443866 -2.98568 0.360851
H  -2.474851 -3.39743 1.815498
H  -1.685984 -3.201802 0.207175
H  -7.023374 -1.66721 -1.524945
H  -7.100562 -1.44691 -3.296726
H  -6.958935 -0.025998 -2.221998
H  2.616096 -2.059315 1.036409
H  1.551308 1.845144 -0.533515
H  -1.229799 4.028839 -0.271787
H  -2.882113 3.590947 0.325493
H  4.965751 -1.771066 0.150708
H  3.907194 2.128141 -1.411928
H  -1.956472 3.132578 2.618235
H  -0.299916 3.536576 2.05447
H  -1.557509 4.806748 2.13023
