program: Gaussian 09
title: 000220328
version: EM64L-G09RevD.01
frameworkgroup: C1[X(C13H17NOS)]
method: RPBEPBE
basis: SDD
operation: Freq
keyword: #p
keyword: freq=noraman
keyword: PBEPBE/SDD
title: #p freq=noraman PBEPBE/SDD
converged: YES YES NO NO
title: Mulliken charges:
elementType: S O N C C C C C C C C C C C C C H H H H H H H H H H H H H H H H H
charge: 0.094120 -0.221667 -0.415772 -0.427186 -0.348435 -0.357848 -0.397459 -0.396718 -0.383315 -0.046920 0.472128 -0.436964 -0.341260 -0.196498 -0.212837 -0.254325 0.302543 0.202142 0.221132 0.218359 0.200827 0.202803 0.200434 0.199597 0.202956 0.203611 0.188731 0.322700 0.222044 0.298177 0.227679 0.227299 0.229923
chargesum: 0.00000
title: Mulliken charges with hydrogens summed into heavy atoms:
elementType: S O N C C C C C C C C C C C C C
charge: 0.094120 -0.221667 -0.093071 -0.124642 0.074838 0.061337 0.005779 0.005835 0.009027 -0.046920 0.472128 -0.214920 -0.043083 0.031181 0.014462 -0.024402
polarizability: 2.76197918e+02 -3.62774819e+00 1.53448315e+02 -1.03597159e+00 -5.81974359e+00 1.00321698e+02
1716.lowfreq: -32.6729 -22.9007 -9.0839 -0.8631 -0.0020 -0.0015 -0.0014 18.7001 44.9071
frequency: -22.2842 11.2591 44.7258 55.4728 78.6831 119.2271 167.8163 212.4192 216.5724 238.4753 240.7195 316.4341 340.6690 357.5953 407.6410 414.1684 426.7033 466.5643 492.1850 502.6541 564.9753 610.2938 613.9719 628.0332 695.4979 699.1164 766.1639 782.1456 786.7304 808.8635 840.0861 841.9243 849.1599 884.5077 887.7961 913.1695 914.3353 971.9560 984.5937 986.5103 996.4273 1025.7525 1041.0546 1052.0923 1077.7534 1086.7592 1106.0358 1117.2846 1134.0025 1173.3293 1190.3278 1191.0309 1224.6312 1253.5255 1254.7754 1257.7727 1264.5892 1301.6439 1321.9340 1326.2189 1330.2898 1339.4265 1341.6289 1348.6029 1383.0110 1429.5826 1458.7089 1462.4451 1463.4385 1469.6541 1477.9979 1484.4312 1510.8778 1601.3288 1614.2984 1646.2047 2967.0817 2971.0338 2971.9752 2977.7752 2981.9586 3005.9332 3031.1944 3032.9049 3041.7789 3052.1316 3059.3501 3113.7352 3133.5101 3145.6438 3166.2631 3194.1641 3512.4723
redmass: 3.6003 4.1811 4.5426 7.7761 5.4019 3.6618 4.3704 1.8736 4.9092 4.0221 4.4317 2.0309 6.8602 6.1158 2.9130 2.6131 3.1009 6.8388 1.7035 2.8176 7.2202 6.3742 6.4588 1.3009 2.0178 3.2099 1.6716 1.4343 6.8393 3.0988 1.2641 1.9419 4.3646 1.9896 1.7873 1.6837 1.4318 1.3575 6.0238 2.4085 1.3072 2.2667 1.8948 1.1404 1.3297 1.6793 2.7899 3.2745 2.1409 1.0504 1.4774 1.1240 1.2543 2.0086 1.3771 1.2941 1.2159 1.2804 1.4157 1.3815 1.3322 1.4473 1.4089 1.4363 6.3083 2.2816 1.0861 1.0894 1.0917 1.0814 1.0952 2.3379 1.8986 5.3526 5.9281 6.8869 1.0636 1.0627 1.0631 1.0637 1.0651 1.0828 1.0953 1.0987 1.1011 1.1006 1.1014 1.0884 1.0869 1.0935 1.0998 1.0952 1.0764
irintensity: 0.0122 1.7194 0.6198 1.0387 4.1360 0.3333 2.4211 0.4017 9.7733 4.7311 2.3600 0.8170 4.3478 0.4134 0.0084 0.4210 0.1028 24.0426 0.1500 29.3372 44.2516 0.7686 0.4080 44.7906 47.2122 42.4412 98.8571 0.3827 74.9823 10.8767 0.1915 6.4066 50.6603 9.9698 14.0045 0.3215 13.8418 0.0932 0.6083 54.5177 2.1872 1.3052 1.0350 0.1763 0.9612 69.7130 0.4241 193.0284 4.6810 0.4942 0.3741 3.4889 0.2080 89.6574 10.7960 9.9472 0.5043 0.3816 82.7335 0.6603 0.1610 0.6132 1.1533 1.1543 78.6871 116.6156 1.9583 11.9168 8.4061 21.3416 3.1935 93.6159 429.7004 45.9781 79.8514 130.4298 38.3609 36.1834 32.1429 14.0325 18.7717 20.7056 71.7726 63.6207 48.7087 20.2434 54.5392 13.3493 0.3210 29.7106 26.8972 4.3886 21.5669
temp: 298.150 k
press: 1.00000 atm
elementType: 16 8 7 6 6 6 6 6 6 6 6 6 6 6 6 6 1 1 1 1 1 1 1 1 1 1 1 1 1 1 1 1 1
symmnumber: 1
zpe: 719300.1 jmol-1
zpe.correction: 0.273967 hartree
zpe.thermalcorrener: 0.288497 hartree
zpe.thermalcorrenthalpy: 0.289442 hartree
zpe.thermalcorrgfe: 0.230283 hartree
zpe.sumelectzpe: -1032.449616 hartree
zpe.sumelectthermal: -1032.435085 hartree
zpe.sumelectthermalent: -1032.434141 hartree
zpe.sumelectthermalfe: -1032.493300 hartree
dipole: 0.0950 -1.3063 0.2569
dipole: 1.3347
quadrupole: -85.0932 -99.1448 -107.1276
quadrupole: 3.7290 -0.7131 -1.0857
quadrupole: 12.0287 -2.0229 -10.0057 3.7290 -0.7131 -1.0857
hfenergy: -1032.7235826 hartree
pointgroup: C01 [X(C13H17N1O1S1)]
dipole: -0.0327938 -0.3367622 0.4015845 debye
polarizability: 274.2501613|-11.3189081|118.6393437|-14.7636002|-24.7105438|137.0784266 unknown
InChI: InChI=1S/C13H17NOS/c15-13(14-11-7-3-1-4-8-11)16-12-9-5-2-6-10-12/h1,3-4,7-8,12,14H,2,5-6,9-10H2
charge 0 multiplicity 1
33 atoms
S  -1.13451 -0.676946 1.41464
O  0.08189 0.732452 -0.651033
N  1.475781 -0.545953 0.757618
C  -2.605843 0.164064 0.526729
C  -3.442811 -0.881713 -0.237323
C  -3.447505 0.952749 1.550015
C  -4.648903 -0.198806 -0.934367
C  -4.653954 1.627216 0.845037
C  -5.511488 0.59444 0.075741
C  0.260966 -0.040514 0.323009
C  2.774029 -0.310041 0.214315
C  3.869521 -0.945849 0.859066
C  3.003241 0.514581 -0.918835
C  5.180808 -0.760054 0.377532
C  4.323439 0.689182 -1.38764
C  5.417338 0.059792 -0.750746
H  -2.109882 0.851563 -0.186247
H  -3.812899 -1.649943 0.471369
H  -2.809817 -1.400275 -0.980289
H  -2.818766 1.710374 2.052359
H  -3.821312 0.264341 2.335077
H  -5.259968 -0.965169 -1.448809
H  -4.274589 0.4919 -1.717804
H  -4.27993 2.393312 0.134898
H  -5.268958 2.159941 1.595658
H  -6.343311 1.103351 -0.44848
H  -5.970582 -0.111541 0.798886
H  1.438896 -1.165497 1.572102
H  3.694418 -1.583728 1.735214
H  2.160681 1.001885 -1.412661
H  6.016192 -1.255679 0.884239
H  4.494486 1.326301 -2.26262
H  6.436043 0.204262 -1.125447
