program: Gaussian 09
title: 000220353
version: EM64L-G09RevD.01
frameworkgroup: C1[X(C22H27NO3)]
method: RPBEPBE
basis: SDD
operation: Freq
keyword: #p
keyword: freq=noraman
keyword: PBEPBE/SDD
title: #p freq=noraman PBEPBE/SDD
converged: YES YES NO NO
title: Mulliken charges:
elementType: O O O N C C C C C C C C C C C C C C C C C C C C C C H H H H H H H H H H H H H H H H H H H H H H H H H H H
charge: -0.217141 -0.299841 -0.225826 -0.002565 0.173279 -0.130730 0.296427 -0.479809 -0.466300 -0.417750 -0.623425 0.459148 -0.766526 0.097946 -0.749348 0.002147 -0.242117 -0.442952 -0.580075 0.507596 -0.413366 0.184403 -0.751349 -0.715164 0.301162 -0.768414 0.196426 0.203887 0.197374 0.199331 0.225403 0.248267 0.200317 0.257231 0.254208 0.235403 0.227407 0.215014 0.235261 0.238055 0.215197 0.232049 0.284195 0.251133 0.228665 0.216880 0.281861 0.229105 0.221534 0.236023 0.247042 0.248488 0.244833
chargesum: 0.00000
title: Mulliken charges with hydrogens summed into heavy atoms:
elementType: O O O N C C C C C C C C C C C C C C C C C C C C C C
charge: -0.217141 -0.299841 -0.225826 -0.002565 0.173279 0.065696 0.296427 -0.078547 -0.041566 0.030835 -0.111986 0.459148 -0.088702 0.097946 -0.060836 0.002147 -0.242117 -0.210904 -0.295880 0.507596 -0.162233 0.184403 -0.023942 -0.028502 0.301162 -0.028051
polarizability: 2.93660155e+02 6.30743997e+00 2.24719294e+02 1.94504147e+00 -1.52609830e+01 2.07742279e+02
1716.lowfreq: -63.8578 -23.3526 -5.5615 -2.8183 -0.0006 -0.0002 0.0005 10.7178 28.7135
frequency: -63.8505 -5.4541 28.5338 38.9213 54.0742 65.7570 70.1509 97.2224 128.9922 136.1701 141.2940 160.4439 168.8398 192.7272 211.2758 215.6889 221.5365 239.4506 244.7346 254.7008 270.1939 271.6031 282.2497 315.1157 318.5529 338.9723 341.1879 352.6718 359.6659 368.5958 387.4679 406.8633 412.3108 451.9842 461.0362 474.5405 494.6117 514.5964 520.0632 548.5317 555.7915 576.0715 588.6531 594.5991 608.8711 630.8954 656.8895 677.5544 694.8994 719.9529 757.2851 763.4740 817.4190 837.4289 839.1190 850.4210 872.2037 886.3562 890.6964 916.3539 922.5601 931.0828 938.7911 949.7376 977.3116 981.5434 986.3800 993.8312 1008.2944 1013.0983 1018.2206 1040.3384 1043.0313 1062.8770 1075.2494 1082.8319 1095.8531 1102.7947 1124.5821 1132.2936 1146.4907 1153.6602 1169.4971 1184.1385 1195.7899 1207.7654 1211.7653 1220.1236 1237.1327 1250.9340 1262.7142 1272.1739 1296.5464 1310.7833 1321.9373 1333.2127 1336.1626 1341.4800 1351.1638 1375.3603 1377.4442 1378.9713 1385.4840 1391.0569 1393.8907 1407.4238 1439.9449 1454.2871 1455.4266 1457.4433 1458.3356 1464.2900 1466.1983 1468.3584 1469.9551 1476.2666 1477.1116 1485.1402 1488.7604 1488.9605 1494.4968 1566.6624 1578.3669 1624.9763 1648.8881 2176.9081 2960.0883 2968.7174 2971.9441 2973.7832 2987.0143 2990.5693 2991.2807 2992.9995 3000.2041 3006.0040 3035.7177 3043.2705 3051.7088 3067.9929 3069.6038 3084.4303 3084.7114 3087.1216 3095.5754 3098.8147 3100.0121 3102.0323 3127.0691 3131.6585 3136.3858 3153.3171 3156.7193
redmass: 1.0424 4.2563 5.6025 6.1144 4.6873 3.7720 6.0949 5.2810 4.1951 5.0542 5.8269 3.7781 3.8675 3.0064 1.2009 1.1663 1.5429 1.9258 2.4752 2.2466 2.3631 1.6550 1.9556 2.9088 2.7460 3.0188 3.1328 2.9756 3.2058 3.5730 2.8766 3.2791 3.4638 4.2274 3.6587 3.3628 4.5984 3.3301 3.0012 3.2392 3.8004 3.9125 3.5538 3.9045 4.1706 3.1968 3.8535 4.0532 4.9059 4.5664 4.8865 3.4960 2.3876 2.2807 2.7657 1.4931 2.3192 2.1200 3.3351 2.0703 2.0420 1.8866 1.7167 1.6406 1.5327 1.6682 1.7457 1.8149 1.5165 1.6919 2.3978 2.1201 1.6353 2.3763 1.7557 1.5693 3.8618 2.8064 1.9440 2.1967 2.3918 1.9023 1.2334 1.9051 2.9500 2.5604 3.5331 1.4783 2.9622 1.6474 1.9412 1.6192 1.9820 1.8272 1.4133 1.4690 1.4184 1.4087 1.4409 7.2301 1.2428 1.2239 1.2033 1.1897 1.2737 3.4988 1.0831 1.0629 1.0649 1.0495 1.0803 1.0570 1.0637 1.0561 1.0812 1.0739 1.2505 1.0685 1.0945 1.1501 1.5756 7.3754 9.6038 7.0710 10.4512 12.6329 1.0810 1.0627 1.0607 1.0429 1.0392 1.0615 1.0663 1.0347 1.0366 1.0364 1.0945 1.0978 1.1032 1.0988 1.0912 1.0994 1.0989 1.0991 1.0967 1.1001 1.1005 1.0993 1.1001 1.0866 1.1016 1.0927 1.0930
irintensity: 1.0320 0.1303 2.5240 1.5234 1.9198 4.3708 0.5647 0.3320 1.6423 1.1787 6.2151 2.1379 4.5995 0.8106 0.0291 0.5571 0.3009 0.6610 0.7484 0.2823 2.7788 0.7229 0.5380 0.2924 3.4391 0.0680 3.7449 0.8042 2.8954 0.7102 1.5581 2.8193 3.0569 3.4113 5.6811 0.8352 1.0254 1.6394 3.3743 7.6596 6.9950 2.0868 12.3289 5.2627 3.0198 5.0004 4.5255 1.5093 0.2307 3.5704 9.9400 0.0859 1.3545 1.2416 4.2952 20.0060 3.0387 4.0709 40.5664 15.4024 11.6157 5.1398 20.0222 1.0962 13.2494 2.0401 0.9236 47.1572 5.8796 5.2438 3.5327 4.4269 14.6921 8.4707 2.7343 4.7017 2.7214 25.5748 49.5211 155.8427 14.1702 45.1124 8.2716 19.5724 117.7050 44.0825 31.9240 0.6775 121.9704 4.7079 27.7291 1.8659 24.0153 6.5250 1.4903 0.3801 5.7366 9.6804 0.6178 11.6106 34.0437 58.1362 8.1906 18.5593 22.6890 22.7886 14.9064 15.1021 1.6306 17.5948 8.4705 1.6981 16.2091 14.7147 2.7873 6.7484 25.4944 7.9495 10.5416 11.3982 37.4257 3.8650 164.5146 13.4948 156.4001 5.7307 14.8958 15.6226 29.6648 65.1994 23.0991 21.5827 26.5879 14.4837 20.5522 4.4599 35.9018 39.8183 37.6801 40.1825 15.5732 25.3555 24.6569 12.9772 5.8551 50.6956 20.6840 20.8542 7.3906 6.8063 9.7863 9.8705 10.9415
temp: 298.150 k
press: 1.00000 atm
elementType: 8 8 8 7 6 6 6 6 6 6 6 6 6 6 6 6 6 6 6 6 6 6 6 6 6 6 1 1 1 1 1 1 1 1 1 1 1 1 1 1 1 1 1 1 1 1 1 1 1 1 1 1 1
symmnumber: 1
zpe: 1150805.1 jmol-1
zpe.correction: 0.438319 hartree
zpe.thermalcorrener: 0.462676 hartree
zpe.thermalcorrenthalpy: 0.463620 hartree
zpe.thermalcorrgfe: 0.386194 hartree
zpe.sumelectzpe: -1133.041079 hartree
zpe.sumelectthermal: -1133.016721 hartree
zpe.sumelectthermalent: -1133.015777 hartree
zpe.sumelectthermalfe: -1133.093203 hartree
dipole: 2.2107 -2.0066 5.8172
dipole: 6.5386
quadrupole: -120.8076 -156.5460 -165.0404
quadrupole: -3.0040 0.0045 -1.0900
quadrupole: 26.6571 -9.0814 -17.5758 -3.0040 0.0045 -1.0900
hfenergy: -1133.479397 hartree
pointgroup: C01 [X(C22H27N1O3)]
dipole: 0.8856898 -0.4544105 2.3720539 debye
polarizability: 293.3450568|8.0761475|220.6544599|1.2528794|-16.966115|212.1222115 unknown
InChI: InChI=1S/C22H27NO3/c1-14(24)26-20(2,3)15-7-8-17-16(11-15)18(25)12-19-21(4,13-23)9-6-10-22(17,19)5/h7-8,11,19H,6,9-10,12H2,1-5H3
charge 0 multiplicity 1
53 atoms
O  0.890025 2.846394 -1.645021
O  -4.359611 -0.491184 0.342534
O  -3.348735 -1.722098 -1.382251
N  1.225356 -1.12453 -2.463281
C  2.19454 0.148128 1.38768
C  3.146476 0.48576 0.18057
C  3.335773 -0.674417 -0.880124
C  2.60041 -1.230793 1.987991
C  3.669158 -2.01868 -0.151592
C  2.647103 -2.364524 0.945737
C  2.749015 1.836173 -0.460361
C  0.712828 0.221233 0.962666
C  2.398727 1.215206 2.51389
C  0.287159 1.137506 -0.045599
C  4.516773 -0.334249 -1.843848
C  1.263318 1.986442 -0.792894
C  2.134995 -0.894402 -1.725377
C  -0.293571 -0.521644 1.626931
C  -1.086563 1.274012 -0.371409
C  -2.078515 0.537144 0.30081
C  -1.657702 -0.361583 1.315435
C  -3.573365 0.778363 0.040727
C  -3.90222 1.25697 -1.386672
C  -4.136755 1.753798 1.098387
C  -4.163846 -1.638553 -0.43899
C  -5.089605 -2.748348 0.022575
H  4.161351 0.604154 0.618013
H  1.932169 -1.494368 2.828056
H  3.611134 -1.114928 2.432949
H  4.67642 -1.90959 0.301167
H  3.733579 -2.827218 -0.903068
H  1.647407 -2.518662 0.495875
H  2.93161 -3.316273 1.432922
H  3.31939 2.057913 -1.378303
H  2.994428 2.658083 0.242078
H  2.044868 2.216778 2.215793
H  1.829208 0.92147 3.414382
H  3.467534 1.288083 2.792801
H  4.734212 -1.198082 -2.496354
H  4.295238 0.527164 -2.494629
H  5.423929 -0.108077 -1.253417
H  -0.020846 -1.237983 2.40813
H  -1.334052 1.977982 -1.172099
H  -2.40795 -0.948081 1.857747
H  -4.997314 1.258594 -1.5281
H  -3.545325 2.291688 -1.532439
H  -3.440328 0.607376 -2.145137
H  -5.218577 1.904483 0.940163
H  -3.623257 2.727851 1.019947
H  -3.979848 1.356794 2.115641
H  -5.838755 -2.945555 -0.764997
H  -5.606628 -2.481555 0.955626
H  -4.508055 -3.675665 0.15974
