program: Gaussian 09
title: 000220326
version: EM64L-G09RevD.01
frameworkgroup: C1[X(C15H14N4O)]
method: RPBEPBE
basis: SDD
operation: Freq
keyword: #p
keyword: freq=noraman
keyword: PBEPBE/SDD
title: #p freq=noraman PBEPBE/SDD
converged: YES YES NO NO
title: Mulliken charges:
elementType: O N N N N C C C C C C C C C C C C C C C H H H H H H H H H H H H H H
charge: -0.315484 -0.407299 0.026522 -0.146954 -0.031167 0.449695 -0.397193 -0.351846 -0.188151 -0.189663 0.190425 -0.248544 -0.345320 -0.302081 -0.166318 -0.201946 -0.201366 -0.238946 0.239637 -0.717920 0.240058 0.285977 0.230976 0.231420 0.364764 0.233266 0.245302 0.281312 0.229690 0.227999 0.230025 0.252613 0.237211 0.253304
chargesum: 0.00000
title: Mulliken charges with hydrogens summed into heavy atoms:
elementType: O N N N N C C C C C C C C C C C C C C C
charge: -0.315484 -0.042535 0.026522 -0.146954 -0.031167 0.449695 -0.157135 -0.065869 0.042825 0.041758 0.190425 -0.015278 -0.100018 -0.020769 -0.166318 0.027744 0.026634 -0.008921 0.239637 0.025208
polarizability: 5.16442105e+02 -1.00993998e+01 2.27744775e+02 -5.13196576e-02 -1.40931908e-01 7.79556627e+01
1716.lowfreq: -5.6439 -0.0007 0.0002 0.0008 1.5826 5.3183 20.2544 30.5593 44.8020
frequency: 20.1592 30.5406 44.8017 49.1013 71.8389 95.3705 108.1673 151.1627 183.2806 204.0122 221.6536 258.0773 269.1414 281.5633 328.5393 374.6588 405.6341 406.6697 418.1664 428.6374 475.3152 514.6499 520.0954 531.2122 588.3115 592.1583 610.4084 614.5312 659.0555 692.6600 695.0301 718.0983 764.4522 770.4015 781.9770 839.6836 843.0310 853.8213 868.5724 922.7915 941.2921 969.9887 976.9447 985.1119 985.6473 987.0147 998.4057 1002.5796 1003.1393 1014.7147 1019.2377 1021.8290 1075.0469 1081.8237 1132.3645 1138.0565 1166.0855 1169.7804 1173.2043 1178.1156 1214.0315 1251.6278 1298.0241 1305.7862 1320.1850 1328.7569 1367.3268 1384.3498 1389.7209 1392.4667 1415.5329 1431.2820 1443.5275 1448.3535 1464.4877 1480.9224 1490.8608 1554.2877 1583.2279 1598.1411 1602.1269 1608.5574 2999.4857 3018.5175 3085.3020 3125.0501 3127.4702 3128.8773 3137.7238 3137.7878 3150.3960 3151.3879 3164.1373 3167.7547 3171.3902 3181.2620
redmass: 3.7864 3.6903 5.5128 4.3510 6.3263 6.1982 5.2154 4.2108 1.1700 5.5244 6.6628 5.1498 5.4042 5.2820 3.5745 6.0121 2.8943 2.9747 5.1310 6.3225 8.0776 3.0851 3.2109 8.0556 5.4393 5.8514 6.4987 6.4746 3.5881 1.9082 1.8151 6.6895 6.5053 1.7095 1.7709 4.2899 1.2516 1.2456 6.5636 1.4250 1.4398 1.9212 1.3530 6.1618 6.1406 1.3654 1.2987 1.2460 1.2706 2.0770 2.1204 1.7351 1.5016 1.5818 2.7077 4.1640 1.4073 1.0614 1.1125 1.1892 2.7512 3.2039 3.7115 1.4661 1.8092 2.6705 6.8295 1.2793 8.3375 7.2051 1.2407 1.0488 2.3841 2.3963 2.2371 2.3998 4.0932 2.3376 6.2220 5.4470 6.2678 6.0422 1.0353 1.0826 1.0943 1.1036 1.0850 1.0868 1.0887 1.0882 1.0937 1.0930 1.0964 1.0983 1.0994 1.0972
irintensity: 0.0579 0.0912 0.2674 2.9317 0.0091 0.5783 3.9261 1.5344 1.0460 0.8177 2.8302 1.7435 0.4410 0.6559 9.9813 0.5046 0.0141 0.9420 12.7092 1.0180 0.6193 12.6147 11.0259 66.2262 8.9037 1.1238 0.4316 2.3938 0.3596 12.2276 81.4794 8.8941 22.5419 55.4201 69.5563 2.3419 1.1468 0.0335 2.2195 4.1956 7.3458 44.9067 6.0112 0.0793 0.7981 0.0000 10.5724 45.2465 45.9364 9.6881 5.8994 4.3878 11.8484 11.4823 8.2823 43.2912 4.1279 0.1437 1.9387 1.6082 23.3514 90.5771 152.6412 30.8351 112.7246 150.2366 41.1586 82.4359 2.2301 6.3784 93.5941 17.2499 8.8813 18.0849 7.6010 2.6517 487.2281 88.9753 2.5324 3.8049 1.1575 8.0173 3.8431 133.7263 4.2528 27.5678 1.7676 6.2808 8.7170 0.6706 22.4871 24.1312 24.5363 36.4390 33.4656 9.6307
temp: 298.150 k
press: 1.00000 atm
elementType: 8 7 7 7 7 6 6 6 6 6 6 6 6 6 6 6 6 6 6 6 1 1 1 1 1 1 1 1 1 1 1 1 1 1
symmnumber: 1
zpe: 683952.6 jmol-1
zpe.correction: 0.260504 hartree
zpe.thermalcorrener: 0.277973 hartree
zpe.thermalcorrenthalpy: 0.278917 hartree
zpe.thermalcorrgfe: 0.212669 hartree
zpe.sumelectzpe: -872.752207 hartree
zpe.sumelectthermal: -872.734738 hartree
zpe.sumelectthermalent: -872.733794 hartree
zpe.sumelectthermalfe: -872.800042 hartree
dipole: 0.5596 -0.7917 0.0059
dipole: 0.9695
quadrupole: -85.7964 -107.8621 -122.2307
quadrupole: -3.2655 -0.0142 -0.0095
quadrupole: 19.5000 -2.5657 -16.9343 -3.2655 -0.0142 -0.0095
hfenergy: -873.012711 hartree
pointgroup: C01 [X(C15H14N4O1)]
dipole: -0.2091861 0.3180961 0.0233121 debye
polarizability: 515.3093388|-19.6790394|228.2613292|-7.3180777|8.9199151|78.5718741 unknown
InChI: InChI=1S/C15H14N4O/c1-12(20)15(18-16-13-8-4-2-5-9-13)19-17-14-10-6-3-7-11-14/h2-11,16H,1H3
charge 0 multiplicity 1
34 atoms
O  -1.50179 -2.902255 -0.319746
N  -2.489462 -0.560378 -0.171259
N  -1.250675 -0.0633 -0.159096
N  2.154674 -0.784606 -0.251263
N  1.012093 -0.140609 -0.196171
C  -3.609722 0.306077 -0.106419
C  -4.900752 -0.282497 -0.126051
C  -3.457268 1.714256 -0.024668
C  -6.041885 0.543504 -0.063617
C  -4.607259 2.524906 0.037143
C  3.301141 0.08172 -0.219026
C  -5.901913 1.948875 0.01826
C  4.557961 -0.576218 -0.277228
C  3.245614 1.502394 -0.13493
C  -0.174824 -0.908424 -0.222203
C  5.752294 0.174372 -0.252216
C  4.441898 2.243057 -0.110567
C  5.697989 1.585692 -0.168796
C  -0.313737 -2.392121 -0.304512
C  0.874044 -3.321644 -0.369665
H  -5.005898 -1.372173 -0.189327
H  -2.449981 2.138522 -0.011706
H  -7.038627 0.089908 -0.0788
H  -4.495429 3.612855 0.100258
H  -2.581217 -1.60898 -0.230649
H  -6.789726 2.588134 0.066636
H  4.570744 -1.669536 -0.341206
H  2.265435 1.986835 -0.090846
H  6.720226 -0.336576 -0.297427
H  4.404055 3.33649 -0.046267
H  6.624263 2.170802 -0.149241
H  1.529071 -3.184733 0.508157
H  0.499542 -4.356371 -0.424568
H  1.512219 -3.08448 -1.238282
