program: Gaussian 09
title: 000220323
version: EM64L-G09RevD.01
frameworkgroup: C1[X(C17H12O2)]
method: RPBEPBE
basis: SDD
operation: Freq
keyword: #pfreq=noraman
keyword: PBEPBE/SDD
title: #p freq=noraman PBEPBE/SDD
converged: YES YES NO NO
title: Mulliken charges:
elementType: O O C C C C C C C C C C C C C C C C C H H H H H H H H H H H H
charge: -0.430542 -0.257313 0.184926 0.211024 0.170397 0.454886 0.448714 -0.775263 -0.366117 -0.379633 -0.447687 -0.452197 -0.255777 -0.250780 -0.258266 -0.246011 -0.245894 -0.342731 0.142981 0.247220 0.240154 0.271458 0.246367 0.246188 0.247020 0.232281 0.231781 0.233177 0.233075 0.289464 0.377098
chargesum: 0.00000
title: Mulliken charges with hydrogens summed into heavy atoms:
elementType: O O C C C C C C C C C C C C C C C C C
charge: -0.053443 -0.257313 0.184926 0.211024 0.170397 0.454886 0.448714 -0.528043 -0.125962 -0.108174 -0.201320 -0.206010 -0.008757 -0.018499 -0.026485 -0.012833 -0.012819 -0.053267 0.142981
polarizability: 2.98818670e+02 1.37233823e+01 2.94218049e+02 -4.25452347e+00 5.36309489e+00 8.18448228e+01
1716.lowfreq: -9.3376 -0.0003 -0.0002 0.0010 1.0277 7.5119 48.5884 49.8081 63.0359
frequency: 48.5182 49.7986 63.0332 91.3941 112.4949 166.0163 174.0317 209.1001 240.1940 269.4786 303.1331 328.0700 387.7769 394.7468 414.9501 460.2736 477.1383 502.0768 535.8026 539.4695 568.9205 585.8364 607.9912 616.7851 635.4646 647.7507 692.4399 707.4860 751.7980 756.3702 772.5574 811.8105 834.4624 860.7671 867.1505 871.4372 888.5257 914.1445 933.6281 949.5480 967.6159 975.5936 990.5864 993.6709 1003.9936 1027.8546 1035.0186 1040.4385 1085.1492 1106.4075 1166.5461 1173.4402 1187.8491 1200.5132 1222.1143 1253.2804 1272.6441 1286.0421 1302.5479 1321.9115 1359.8959 1363.3727 1389.4183 1416.2677 1438.4724 1444.5311 1448.4950 1490.4737 1529.8967 1561.2607 1579.6950 1615.8545 1624.1605 1632.2294 1638.8435 3097.7076 3118.2648 3124.0444 3124.9743 3137.3594 3138.3427 3155.9739 3159.2552 3169.5611 3172.1216 3180.6811 3524.4182
redmass: 5.1388 7.6335 6.4873 5.2149 3.7190 5.8515 3.6964 5.0660 4.9523 4.6350 4.8006 3.2868 6.4056 4.5677 3.5400 4.7698 2.9571 3.4432 4.8803 2.4758 4.1311 1.7833 6.0382 2.5436 5.6397 5.5720 4.6336 5.3138 1.3172 2.9203 1.3707 2.2220 4.0172 2.5699 2.2250 1.6425 2.4542 3.4906 1.9592 4.8306 1.3793 1.4398 1.3367 1.3590 1.3180 2.5204 1.9931 2.2593 2.8861 2.2547 1.2933 1.1308 1.1584 1.3022 1.3456 1.5844 2.0626 1.8804 1.9086 1.8232 2.4396 4.2593 1.7753 4.7370 9.7514 2.5891 2.2377 2.6989 6.0011 7.5955 5.4039 7.0585 6.4104 6.2456 6.2129 1.0879 1.0914 1.0868 1.0867 1.0889 1.0899 1.0947 1.0966 1.0991 1.0940 1.0948 1.0640
irintensity: 0.4913 1.4875 0.0825 1.1770 0.0780 7.2810 4.8816 0.1840 0.9562 0.1414 1.5799 5.0352 1.2701 1.2229 5.6215 15.6177 1.2163 1.0479 61.2750 50.9932 0.6709 70.0584 1.9338 19.3634 2.2488 3.5023 46.9798 22.4693 103.6198 9.0822 2.3423 6.8057 5.1678 14.7088 17.8345 5.1699 3.6066 4.8224 24.2029 14.7807 1.2355 24.4435 24.3614 1.4993 28.6238 16.0940 135.9593 281.7201 139.7420 1.9771 9.4687 0.8059 1.1035 3.4408 4.6659 3.0026 8.1187 51.7991 29.9544 1.7755 14.4587 64.4434 2.7820 0.0838 6.2674 10.3149 14.1644 2.8297 10.9700 42.7845 1.6397 411.7727 41.0583 54.7185 99.0074 1.2230 3.6230 0.4396 5.1074 7.0123 16.5551 26.4594 33.1567 30.4275 6.1083 13.5477 58.5594
temp: 298.150 k
press: 1.00000 atm
elementType: 8 8 6 6 6 6 6 6 6 6 6 6 6 6 6 6 6 6 6 1 1 1 1 1 1 1 1 1 1 1 1
symmnumber: 1
zpe: 623799.7 jmol-1
zpe.correction: 0.237593 hartree
zpe.thermalcorrener: 0.252464 hartree
zpe.thermalcorrenthalpy: 0.253409 hartree
zpe.thermalcorrgfe: 0.194915 hartree
zpe.sumelectzpe: -804.181007 hartree
zpe.sumelectthermal: -804.166135 hartree
zpe.sumelectthermalent: -804.165191 hartree
zpe.sumelectthermalfe: -804.223684 hartree
dipole: -2.3640 1.3481 0.7073
dipole: 2.8118
quadrupole: -95.0967 -97.4321 -117.4548
quadrupole: 5.0666 1.4362 -2.6039
quadrupole: 8.2312 5.8958 -14.1269 5.0666 1.4362 -2.6039
hfenergy: -804.4185997 hartree
pointgroup: C01 [X(C17H12O2)]
dipole: -1.0264184 -0.2931965 -0.2903671 debye
polarizability: 292.72189|-13.5581802|298.9500462|3.0351666|18.1476789|83.2096057 unknown
InChI: InChI=1S/C17H12O2/c18-17(19)10-9-16-14-7-3-1-5-12(14)11-13-6-2-4-8-15(13)16/h1-11,18H
charge 0 multiplicity 1
31 atoms
O  4.939416 -0.76173 -0.901888
O  4.508177 0.901402 0.671432
C  -0.632559 1.319985 0.137112
C  -0.392546 -1.160471 0.017195
C  0.206853 0.14635 0.132571
C  -2.07583 1.180595 -0.017484
C  -1.837668 -1.272814 -0.164921
C  -2.636511 -0.106482 -0.183097
C  -0.104776 2.658246 0.244652
C  0.352525 -2.389784 0.13558
C  -2.911752 2.354318 -0.021757
C  -2.442006 -2.573993 -0.303375
C  1.658662 0.340116 0.268244
C  -0.941632 3.772146 0.244443
C  -0.265812 -3.632017 0.014162
C  -2.363391 3.623961 0.113576
C  -1.6766 -3.731239 -0.231132
C  2.665046 -0.339991 -0.367862
C  4.071076 0.022701 -0.116517
H  -3.720756 -0.20388 -0.322211
H  0.975628 2.814088 0.312226
H  1.42055 -2.348722 0.359706
H  -3.994142 2.223058 -0.137442
H  -3.526524 -2.630866 -0.454384
H  1.994062 1.149324 0.93308
H  -0.510736 4.775161 0.336288
H  0.328461 -4.546238 0.119966
H  -3.004628 4.511728 0.111815
H  -2.143462 -4.716393 -0.335376
H  2.485333 -1.117569 -1.114629
H  5.87664 -0.485188 -0.713269
