program: Gaussian 09
title: 000220322
version: EM64L-G09RevD.01
frameworkgroup: C1[X(C10H10N2O3)]
method: RPBEPBE
basis: SDD
operation: Freq
keyword: #p
keyword: freq=noraman
keyword: PBEPBE/SDD
title: #p freq=noraman PBEPBE/SDD
converged: YES YES NO NO
title: Mulliken charges:
elementType: O O O N N C C C C C C C C C C H H H H H H H H H H
charge: -0.333710 -0.448040 -0.236434 -0.396561 0.038149 0.443657 -0.396316 -0.350344 -0.187946 -0.190194 -0.246270 -0.121687 0.274732 -0.718190 0.141814 0.240715 0.294961 0.364087 0.231684 0.233792 0.234091 0.239780 0.250495 0.252007 0.385729
chargesum: 0.00000
title: Mulliken charges with hydrogens summed into heavy atoms:
elementType: O O O N N C C C C C C C C C C
charge: -0.333710 -0.062310 -0.236434 -0.032474 0.038149 0.443657 -0.155602 -0.055383 0.043738 0.043597 -0.012179 -0.121687 0.274732 0.024092 0.141814
polarizability: 2.80092083e+02 -2.70279188e+00 1.43937737e+02 -3.13115490e-02 2.05457292e-01 5.69396681e+01
1716.lowfreq: -4.6804 -0.0010 -0.0009 -0.0009 3.8757 9.3571 16.6380 42.6675 59.8014
frequency: 16.4771 42.6624 59.7820 75.4944 103.8188 181.3876 200.0905 214.8796 233.3621 310.5882 317.2130 335.6767 404.6022 406.7723 433.6880 480.5304 516.3554 546.7181 570.0548 590.0577 611.9710 633.5181 636.8071 693.3833 728.6408 735.5851 772.6839 834.5834 845.7666 927.2643 974.5673 980.3885 985.4546 1002.9200 1003.7475 1020.1580 1021.1175 1026.1240 1082.7972 1108.9908 1162.3343 1174.0944 1181.4846 1239.1068 1315.1598 1324.4106 1328.6362 1339.2318 1384.0436 1392.0233 1429.5152 1442.3426 1447.7590 1479.5622 1482.2848 1549.5806 1598.1578 1608.4562 1645.0296 2984.7930 3005.8036 3094.4497 3129.6308 3129.7030 3138.7809 3151.3010 3167.5638 3179.0075 3514.9612
redmass: 7.7641 3.9603 4.3962 5.9297 7.1846 1.0868 4.4827 6.5609 6.1446 4.4733 4.6825 4.9945 4.9620 3.2554 11.6416 7.6756 3.1164 5.3867 1.5371 4.6371 6.4044 1.9879 4.3918 1.9550 6.1085 6.2764 1.7373 4.0616 1.2517 1.4198 2.2687 1.3576 6.1554 1.3219 3.4494 2.1170 1.1901 1.6906 1.6388 2.5828 2.0863 1.0696 1.2869 2.4214 2.4060 2.0181 2.7788 4.4589 1.2679 8.7326 1.3189 1.0480 2.3637 2.9052 2.6813 2.3290 5.8152 6.0150 8.2325 1.0829 1.0357 1.0954 1.0870 1.1028 1.0882 1.0935 1.0977 1.0984 1.0638
irintensity: 1.0331 1.2189 1.6487 1.3044 0.3619 1.2700 0.6822 2.6716 4.6482 3.2102 3.6030 9.1764 6.0304 1.4847 0.7955 1.0851 19.1199 68.3881 71.9906 7.3161 1.4084 67.7017 28.7696 35.3842 36.0030 13.6947 59.3971 4.6175 1.0993 4.9673 43.2834 2.5204 2.0008 0.1565 322.1393 25.8504 110.3011 1.8641 16.7295 172.4248 39.1974 3.0649 13.9404 95.1884 47.5849 9.1517 0.4263 296.8430 115.1131 3.1018 212.5243 16.7608 32.4163 196.9321 167.1803 75.6576 3.6966 0.7370 266.4014 90.9814 0.9635 5.4811 4.4644 19.1994 0.8980 22.6282 22.3081 11.6672 55.5518
temp: 298.150 k
press: 1.00000 atm
elementType: 8 8 8 7 7 6 6 6 6 6 6 6 6 6 6 1 1 1 1 1 1 1 1 1 1
symmnumber: 1
zpe: 488590.1 jmol-1
zpe.correction: 0.186094 hartree
zpe.thermalcorrener: 0.199799 hartree
zpe.thermalcorrenthalpy: 0.200743 hartree
zpe.thermalcorrgfe: 0.143609 hartree
zpe.sumelectzpe: -721.137278 hartree
zpe.sumelectthermal: -721.123572 hartree
zpe.sumelectthermalent: -721.122628 hartree
zpe.sumelectthermalfe: -721.179762 hartree
dipole: -0.5989 -1.0939 0.0009
dipole: 1.2472
quadrupole: -61.1718 -91.4292 -89.5179
quadrupole: 1.8803 -0.0006 -0.0441
quadrupole: 19.5345 -10.7229 -8.8116 1.8803 -0.0006 -0.0441
hfenergy: -721.3233717 hartree
pointgroup: C01 [X(C10H10N2O3)]
dipole: -0.2533878 -0.4200267 -0.0116905 debye
dipolederiv: -0.3901376 -0.2975003 0.004694 0.3572337 -0.9308456 0.061791 -0.0204702 -0.0115175 -0.3546001 -1.5512088 0.0691727 -0.1203656 0.060766 -0.2877642 0.0022672 -0.1168596 0.0041773 -0.4147264 -0.5778553 -0.0217499 -0.0248669 -0.315354 -1.1177605 -0.0104737 -0.0126239 0.0239045 -0.3226868 -0.9889023 0.0863261 -0.0987821 -0.9956269 -0.1227694 -0.1124416 -0.0581755 0.0079373 -0.1505528 1.7191291 -0.0275079 0.203554 0.5739389 -0.1565989 0.0683909 0.1795416 -0.0017131 -0.0651626 0.6987295 -0.0796007 0.0742246 -0.1263796 0.0582664 -0.0135572 0.0765999 -0.0080545 0.0674338 -0.1522808 -0.0307009 0.0030943 0.0465528 0.0294323 -0.001482 0.0000534 -0.0102757 -0.1740684 -0.0834783 0.0416441 0.0047783 0.033809 -0.0684021 0.0012396 0.0047086 0.0021133 -0.1428372 0.0816401 0.0801022 0.0213236 0.2107375 0.0423465 0.0172952 0.0172883 0.002764 -0.1366403 -0.1551765 -0.0327718 -0.0011982 -0.1870061 0.1750437 -0.0310388 0.0042146 -0.014056 -0.1367113 0.0058685 -0.0373592 0.0195359 0.0465654 -0.0793965 0.0024191 0.0173394 -0.0069073 -0.1636133 -1.870325 0.0974966 -0.2065301 0.5730216 -0.7103555 0.090263 -0.2256463 0.0381186 -0.0811949 0.9448009 -0.1074857 0.0947026 -1.1834728 1.2660799 -0.1758421 0.1392666 -0.0552451 0.2152783 -0.6184705 0.1864002 -0.0788761 0.0682102 0.0251502 0.006807 -0.0729923 0.0206113 -0.010951 2.009144 0.1935905 0.1768133 0.8463578 1.4732999 0.0541033 0.1506591 -0.0191518 0.2345305 0.0843775 0.0786644 -0.0118277 0.0557774 -0.0532988 0.0135048 -0.0111983 0.0162594 0.1670952 0.0887409 -0.0679721 -0.0065809 -0.066067 0.0653662 -0.003894 -0.0067735 -0.0039923 0.1693068 0.2173211 -0.1149824 -0.0068719 -0.0883953 0.2603898 -0.0080548 -0.0084991 -0.0104543 0.3243795 -0.035666 -0.0915298 -0.0182582 -0.1223681 -0.0140397 -0.0077143 -0.0170801 -0.0043097 0.1567949 0.0498232 0.0455839 -0.0130433 0.0863074 -0.0924044 0.0177182 -0.0143007 0.0132207 0.1530228 -0.1164313 0.0483436 -0.032506 0.0535321 0.0807841 0.0086855 -0.0328365 0.0081427 0.1630067 0.0807805 -0.035852 -0.0028479 0.0761015 -0.1183878 0.0194548 -0.0085034 0.0070122 0.1156 0.091188 0.0033034 -0.0367102 0.0242484 0.084248 -0.0786567 -0.0574939 -0.0612016 -0.0090618 0.0660174 -0.0057363 0.0555519 0.0129663 0.0984226 0.0732467 0.0733928 0.0517723 0.0071183 0.4023719 0.0201212 0.0009927 -0.0414561 0.0931938 0.005969 0.000389 0.0108455 0.3892401 unknown
polarizability: 276.8695406|-7.8858395|144.2791574|24.6801583|-4.0081952|59.8207896 unknown
InChI: InChI=1S/C10H10N2O3/c1-7(13)9(10(14)15)12-11-8-5-3-2-4-6-8/h2-6,11,14H,1H3
charge 0 multiplicity 1
25 atoms
O  1.192847 -2.366837 0.406495
O  3.929976 0.836373 0.570652
O  2.205029 2.362119 0.348277
N  -0.585399 -0.579641 0.136141
N  0.37163 0.340176 0.209182
C  -1.940877 -0.188315 -0.027527
C  -2.918385 -1.213013 -0.1005
C  -2.311243 1.178132 -0.11354
C  -4.276095 -0.865562 -0.260033
C  -3.671174 1.507636 -0.272618
C  -4.658506 0.493508 -0.346425
C  1.675182 -0.032101 0.370514
C  2.102264 -1.446482 0.476954
C  3.539246 -1.881711 0.666216
C  2.562611 1.164082 0.422905
H  -2.617536 -2.26525 -0.03243
H  -1.533679 1.944578 -0.053962
H  -0.275782 -1.587643 0.208086
H  -5.03302 -1.655028 -0.316443
H  -3.964726 2.56081 -0.339499
H  -5.713271 0.760701 -0.470065
H  3.556359 -2.981337 0.718699
H  3.971296 -1.446824 1.583499
H  4.17605 -1.526573 -0.161622
H  4.435906 1.693505 0.594441
