program: Gaussian 09
title: 000220320
version: EM64L-G09RevD.01
frameworkgroup: C1[X(C12H10ClNO)]
method: RPBEPBE
basis: SDD
operation: Freq
keyword: #p
keyword: freq=noraman
keyword: PBEPBE/SDD
title: #p freq=noraman PBEPBE/SDD
converged: NO YES NO NO
title: Mulliken charges:
elementType: Cl O N C C C C C C C C C C C C H H H H H H H H H H
charge: -0.032450 -0.297359 -0.704012 0.396807 0.359149 -0.255724 -0.305416 0.547513 -0.444919 -0.422790 -0.336611 -0.375725 -0.215463 -0.193360 -0.256481 0.256576 0.247909 0.224468 0.254710 0.254036 0.223221 0.226693 0.226163 0.310977 0.312087
chargesum: 0.00000
title: Mulliken charges with hydrogens summed into heavy atoms:
elementType: Cl O N C C C C C C C C C C C C
charge: -0.032450 -0.297359 -0.080948 0.396807 0.359149 -0.255724 -0.048839 0.547513 -0.197010 -0.198322 -0.081901 -0.121689 0.007759 0.033333 -0.030318
polarizability: 2.18387401e+02 -1.57161304e+01 1.19216177e+02 1.16645847e+01 5.32119505e-01 1.07941616e+02
1716.lowfreq: -6.0670 -0.0009 -0.0003 -0.0003 3.2882 9.1901 22.7232 36.1588 53.4244
frequency: 22.6802 35.9573 53.4170 136.8826 171.3748 186.1418 220.5899 279.1804 306.6713 334.2740 355.7143 371.4087 404.4661 411.0308 442.8204 485.9452 497.9248 517.9431 541.0845 604.7707 610.4144 675.0517 690.4311 695.5435 735.9090 756.0082 810.4075 830.3247 831.4901 842.8259 886.3467 897.4057 937.0101 964.6848 982.4536 985.0723 1015.9224 1019.8570 1031.8263 1078.0808 1135.8632 1159.0471 1168.5777 1185.5188 1210.8096 1246.7770 1308.7730 1323.0389 1371.3071 1388.5669 1427.5911 1442.6422 1469.7939 1495.6211 1567.4489 1597.0299 1608.6609 1628.7023 1645.2516 3128.3105 3133.7264 3137.8316 3153.6653 3155.2273 3164.4596 3164.8835 3173.6520 3570.4237 3710.0273
redmass: 7.6048 4.0777 5.0069 5.0115 6.4252 5.1271 5.7541 6.8682 5.0311 4.1659 1.0794 1.2977 5.5388 2.9335 2.8886 3.7296 3.7245 7.4198 8.1535 3.4983 5.4987 7.1768 2.2454 3.8216 4.4554 1.5653 1.5461 1.2922 4.9009 1.6969 5.7080 1.4403 1.3585 1.3614 1.3314 5.5016 2.8849 2.1247 1.5017 1.4934 1.2690 1.5780 1.0942 1.6497 2.2516 1.6186 1.3252 3.2927 5.4521 9.1020 3.9347 2.3347 2.2657 3.6493 7.6255 6.5649 6.3000 3.4748 1.3966 1.0847 1.0890 1.0892 1.0921 1.0928 1.0961 1.0960 1.1000 1.0450 1.1041
irintensity: 1.3878 0.3872 1.6146 0.0622 0.4433 3.9654 0.8494 0.4701 0.9443 8.0377 11.1074 300.8220 1.3169 0.0424 4.8340 18.5018 1.2461 1.3627 1.0632 5.0859 2.5702 6.3155 24.6492 0.0369 5.6795 85.9287 33.0160 2.6260 62.6504 50.6781 17.0965 7.6883 0.2485 0.1906 0.3034 0.6177 24.4530 22.4461 1.5670 10.8070 6.8311 49.8927 5.2312 4.1939 332.7907 24.2811 1.0900 8.1416 17.6278 4.1830 1.4641 1.6611 193.7409 229.2926 24.2975 33.8043 39.3764 50.9913 275.5219 1.7226 17.5869 14.0732 8.6992 27.7382 16.2782 4.9826 9.1106 90.9333 23.5932
temp: 298.150 k
press: 1.00000 atm
elementType: 17 8 7 6 6 6 6 6 6 6 6 6 6 6 6 1 1 1 1 1 1 1 1 1 1
symmnumber: 1
zpe: 493642.4 jmol-1
zpe.correction: 0.188018 hartree
zpe.thermalcorrener: 0.201225 hartree
zpe.thermalcorrenthalpy: 0.202169 hartree
zpe.thermalcorrgfe: 0.146662 hartree
zpe.sumelectzpe: -1052.248474 hartree
zpe.sumelectthermal: -1052.235268 hartree
zpe.sumelectthermalent: -1052.234323 hartree
zpe.sumelectthermalfe: -1052.289830 hartree
dipole: 3.8411 -2.1850 1.7164
dipole: 4.7407
quadrupole: -63.8680 -93.2445 -93.3365
quadrupole: -4.7375 5.6488 0.5668
quadrupole: 19.6151 -9.7615 -9.8535 -4.7375 5.6488 0.5668
hfenergy: -1052.4364924 hartree
pointgroup: C01 [X(C12H10Cl1N1O1)]
dipole: 1.4438403 -0.9808294 0.6573041 debye
dipolederiv: -0.2001825 0.2003739 0.0052778 0.2274372 -0.6246135 -0.064093 0.0255968 -0.0956906 -0.0685653 -2.0418284 0.0282164 0.1960351 0.1389993 -0.2476164 0.0057576 0.2279991 0.0174384 -0.3850455 -1.6049604 0.2182699 -0.174815 0.2149617 -0.2302767 0.2476564 -0.307434 0.2735084 -0.7400257 1.0849104 0.0591778 0.0494743 -0.1953909 -0.2638301 -0.0555908 0.4788969 -0.0674226 -0.0244223 1.551804 0.0481975 -0.3811103 0.0832306 0.1184113 -0.0266215 -0.8248066 -0.0281908 0.3141375 0.3483594 -0.2046437 0.1405826 -0.2970756 0.9322914 0.1200031 0.0233524 0.243833 0.0643539 0.0612853 -0.2707633 0.0402166 -0.0083963 0.1484446 0.0836065 0.0792141 -0.0329711 -0.0498566 1.6089942 -0.2987258 0.40393 -0.3067047 0.1077617 -0.1328022 0.507753 -0.1428789 0.2812146 -0.4797795 0.0273604 -0.0616133 0.449735 -0.2517753 0.1628113 0.0478248 -0.0125957 -0.1583298 -0.4505163 0.1500945 0.0181539 -0.3162721 0.0572802 -0.0179636 -0.1774535 0.1661724 -0.2348876 -0.255234 -0.0023182 0.0213298 -0.1013888 -0.1587292 0.0082295 0.3880988 -0.0117556 -0.1840692 -0.4398234 -0.0356841 0.1330093 0.0193753 -0.1469609 -0.0903786 -0.0025526 -0.0622957 0.0277749 0.1649794 -0.045154 0.0444838 -0.0174962 -0.1040466 -0.0853357 -0.0697882 -0.0816363 0.1213545 0.1525769 -0.0263404 -0.0263607 -0.0393641 -0.1102415 -0.0775899 0.0066645 -0.0860699 0.0990721 -0.0969332 0.0154306 -0.1088591 0.0078627 -0.1971856 -0.0056873 -0.0677291 -0.0071557 -0.1399168 0.0828003 -0.0480444 -0.0680866 -0.0641778 0.0207354 -0.056265 -0.0742052 -0.0587335 0.1051873 0.0156356 -0.0441355 -0.0664751 -0.0456125 0.0326532 -0.0656527 -0.0798737 -0.0677643 0.1236284 0.0079977 0.1069073 -0.015168 0.1062808 -0.0638631 -0.0478846 -0.0307566 -0.0378712 0.1479152 -0.0068545 0.0413521 -0.0604323 0.0635215 0.1271212 0.0235947 -0.1131204 0.0234918 0.0736008 0.1191587 0.0004032 0.0220328 0.0063878 0.1417196 0.068849 0.007675 0.066786 -0.0396139 0.0691531 0.0091696 -0.0036014 -0.000812 0.123176 0.0828934 0.0321994 0.0826198 -0.0985431 -0.0965871 0.0526436 -0.0825445 0.0573221 0.1322573 0.0438345 -0.081925 0.0441517 0.050112 -0.0920574 -0.0042001 0.0955227 -0.0028477 0.159207 0.0318221 0.1047685 0.0318197 0.040086 0.2438842 0.0028019 -0.0649342 -0.0319776 0.1607413 -0.0847647 -0.0657837 -0.0803044 0.3314932 0.2532174 0.0196108 -0.0560482 0.0524021 0.1373387 -0.0684285 -0.0346145 -0.0764847 0.3433451 unknown
polarizability: 215.6141289|-22.594822|121.773512|11.9641485|-0.0150926|108.1575535 unknown
InChI: InChI=1S/C12H10ClNO/c13-11-8-9(14)6-7-12(11)15-10-4-2-1-3-5-10/h1-8H,14H2
charge 0 multiplicity 1
25 atoms
Cl 0.727865 2.474533 0.172261
O  -0.56137 0.095244 -1.301992
N  4.635188 -0.954278 0.6947
C  0.702498 -0.176581 -0.724187
C  -1.728326 -0.020725 -0.499258
C  1.452687 0.822848 -0.064941
C  1.297472 -1.444662 -0.907638
C  3.345469 -0.699821 0.229479
C  2.751653 0.583438 0.411879
C  2.596807 -1.712431 -0.44075
C  -1.714593 -0.469495 0.840358
C  -2.936781 0.332246 -1.140951
C  -2.939374 -0.563003 1.540759
C  -4.149076 0.232193 -0.427417
C  -4.158499 -0.215708 0.916087
H  0.721254 -2.213993 -1.431432
H  3.300789 1.385658 0.915007
H  3.038275 -2.703025 -0.598264
H  -0.771894 -0.737491 1.327333
H  -2.905419 0.680128 -2.177734
H  -2.934998 -0.908052 2.580943
H  -5.087771 0.506784 -0.921449
H  -5.102004 -0.290239 1.466866
H  5.067123 -1.86244 0.554704
H  5.175724 -0.232628 1.161641
