program: Gaussian 09
title: 000220319
version: EM64L-G09RevD.01
frameworkgroup: C1[X(C14H12N2O)]
method: RPBEPBE
basis: SDD
operation: Freq
keyword: #p
keyword: freq=noraman
keyword: PBEPBE/SDD
title: #p freq=noraman PBEPBE/SDD
converged: YES YES NO NO
title: Mulliken charges:
elementType: O N N C C C C C C C C C C C C C C H H H H H H H H H H H H
charge: -0.245649 -0.423424 0.046238 0.287341 0.482353 -0.318026 -0.346651 -0.413520 -0.359173 0.102828 -0.242724 -0.232267 -0.228941 -0.189723 -0.191425 -0.257222 -0.393049 0.265447 0.275456 0.222404 0.269628 0.227621 0.230344 0.230110 0.228885 0.229021 0.281933 0.232396 0.229789
chargesum: 0.00000
title: Mulliken charges with hydrogens summed into heavy atoms:
elementType: O N N C C C C C C C C C C C C C C
charge: -0.245649 -0.141490 0.046238 0.287341 0.482353 -0.052579 -0.071195 -0.191116 -0.089546 0.102828 -0.015102 -0.001923 0.001169 0.039162 0.037596 -0.024825 -0.163260
polarizability: 3.22625298e+02 -1.69157201e+01 1.95958807e+02 -1.13882693e+01 -5.36626229e-01 7.05256269e+01
1716.lowfreq: -9.4780 -5.0447 -3.2604 -0.0004 -0.0003 0.0002 18.6295 32.7156 43.4402
frequency: 18.4471 32.6636 43.4321 67.2943 137.1856 150.9870 177.5906 229.2673 244.9576 269.7408 279.6568 366.3532 400.9671 406.2205 422.7491 462.2916 507.4614 542.0957 611.4266 614.2727 636.6455 647.9169 651.3188 682.1415 694.6626 700.4690 740.6973 763.1146 796.7721 833.6499 854.7672 860.4164 905.6750 919.7415 948.4347 969.0996 983.1800 988.8745 990.7421 991.8678 1006.4768 1020.2373 1023.2934 1078.2261 1080.7264 1092.9377 1150.5204 1171.7840 1172.7803 1179.7386 1188.9059 1258.9719 1293.7202 1307.5100 1316.8987 1336.3972 1383.9272 1390.6351 1432.7641 1440.9414 1476.8749 1482.9854 1504.8756 1533.1783 1541.0741 1587.3385 1604.9731 1608.7268 1613.9033 3005.7748 3116.8805 3125.5061 3135.6871 3138.0597 3147.4716 3152.4980 3165.1085 3167.2136 3181.1995 3183.6850 3372.3733
redmass: 4.0868 4.0686 5.1500 6.0906 5.1648 5.9768 3.3045 4.7724 4.1838 4.2680 7.3210 7.2450 2.8499 2.8911 4.5439 4.7000 2.8933 6.9881 6.4564 6.4055 6.7790 1.9718 2.3950 4.0837 1.9238 1.5220 5.1770 1.7106 2.1683 1.2583 4.2550 1.2642 1.4423 1.5538 1.4559 1.3692 5.6535 1.9627 2.1397 1.5138 1.3363 2.1420 2.5886 1.9646 1.6339 2.2298 4.3012 1.0590 1.0566 1.1100 1.1369 3.1644 1.3446 2.1310 1.3342 1.6525 8.7119 7.3833 2.3227 2.2995 2.2442 2.2698 4.9004 3.5343 3.5543 6.2503 4.7515 6.0075 6.0319 1.0873 1.0884 1.0853 1.0868 1.0894 1.0930 1.0942 1.0986 1.0979 1.0969 1.0951 1.0745
irintensity: 0.2186 1.3114 0.5486 1.2614 2.1133 2.6789 14.0068 11.0055 17.6740 3.6037 9.3277 0.5013 0.0414 0.0412 0.8073 1.1442 19.2199 31.8437 3.4304 0.5568 13.0036 31.0271 23.0801 2.4111 60.1883 67.5783 4.7315 90.7532 35.0012 0.2352 5.2211 4.1281 10.5392 43.0158 2.2194 0.0203 0.6973 0.8746 2.0296 0.8513 0.8737 3.1845 19.4045 68.8719 18.7476 22.0774 152.1045 1.0532 0.7009 2.8308 28.1958 287.2895 107.8369 165.6750 6.0692 24.4408 4.5767 0.2342 11.4483 0.2126 18.4940 88.0526 191.5447 215.1674 307.0648 20.9974 4.4425 11.6065 50.6610 40.6997 11.5923 0.1848 0.1800 15.3324 24.5362 15.5004 29.3274 30.7771 7.4124 4.4541 3.9579
temp: 298.150 k
press: 1.00000 atm
elementType: 8 7 7 6 6 6 6 6 6 6 6 6 6 6 6 6 6 1 1 1 1 1 1 1 1 1 1 1 1
symmnumber: 1
zpe: 590464.9 jmol-1
zpe.correction: 0.224896 hartree
zpe.thermalcorrener: 0.239148 hartree
zpe.thermalcorrenthalpy: 0.240092 hartree
zpe.thermalcorrgfe: 0.181237 hartree
zpe.sumelectzpe: -724.201499 hartree
zpe.sumelectthermal: -724.187248 hartree
zpe.sumelectthermalent: -724.186304 hartree
zpe.sumelectthermalfe: -724.245159 hartree
dipole: -3.9030 1.5558 0.3380
dipole: 4.2153
quadrupole: -87.7904 -91.5417 -104.6490
quadrupole: 16.0361 -2.7020 -1.0970
quadrupole: 6.8700 3.1187 -9.9886 16.0361 -2.7020 -1.0970
hfenergy: -724.4263956 hartree
pointgroup: C01 [X(C14H12N2O1)]
dipole: 1.5003416 0.7037747 0.0632087 debye
polarizability: 319.1428619|29.726678|179.7795372|-14.2075711|43.6771189|90.1873332 unknown
InChI: InChI=1S/C14H12N2O/c17-14(12-7-3-1-4-8-12)11-15-16-13-9-5-2-6-10-13/h1-11,16H
charge 0 multiplicity 1
29 atoms
O  -2.695846 -2.670772 -0.990435
N  1.673538 -1.131493 -0.808326
N  0.364887 -0.869515 -0.568425
C  -2.649938 -0.395779 -0.181677
C  2.695474 -0.242597 -0.394939
C  -2.042357 0.889694 -0.163184
C  -3.98569 -0.533991 0.289634
C  4.037078 -0.549864 -0.742137
C  2.400084 0.926565 0.352834
C  -1.991289 -1.636585 -0.718178
C  -2.759633 2.006624 0.318003
C  -4.694204 0.579964 0.779631
C  -4.082525 1.857026 0.794781
C  5.078323 0.313861 -0.3439
C  3.452589 1.780088 0.740392
C  4.79407 1.48428 0.397505
C  -0.535827 -1.76113 -0.953675
H  -1.020089 1.009559 -0.528361
H  -4.443905 -1.527883 0.252184
H  4.263616 -1.454773 -1.320595
H  1.36346 1.140561 0.625007
H  -2.287425 2.995516 0.318545
H  -5.719622 0.458189 1.145715
H  -4.63383 2.727002 1.169502
H  6.111691 0.07171 -0.614952
H  3.223964 2.681623 1.319589
H  1.951831 -1.998743 -1.294055
H  5.604133 2.153233 0.705518
H  -0.25666 -2.714172 -1.444201
