program: Gaussian 09
title: 000220374
version: EM64L-G09RevD.01
frameworkgroup: C1[X(C21H22N2O7)]
method: RPBEPBE
basis: SDD
operation: Freq
keyword: #p
keyword: freq=noraman
keyword: PBEPBE/SDD
title: #p freq=noraman PBEPBE/SDD
converged: YES YES NO NO
title: Mulliken charges:
elementType: O O O O O O O N N C C C C C C C C C C C C C C C C C C C C C H H H H H H H H H H H H H H H H H H H H H H
charge: -0.269303 -0.193520 -0.231254 -0.207187 -0.212283 -0.208083 -0.210591 0.028668 0.027006 0.176550 -0.464799 -0.494724 -0.601728 -0.578606 0.184894 0.194949 0.547835 0.517025 -0.795402 -0.378225 -0.425115 -0.396292 -0.366878 -0.364466 -0.354915 -0.356376 -0.365419 -0.503707 0.367956 0.367915 0.229179 0.239826 0.222300 0.272118 0.216722 0.257170 0.264446 0.223110 0.242114 0.266190 0.245150 0.247437 0.244033 0.240686 0.277862 0.286839 0.284374 0.286138 0.284789 0.237972 0.242949 0.254672
chargesum: 0.00000
title: Mulliken charges with hydrogens summed into heavy atoms:
elementType: O O O O O O O N N C C C C C C C C C C C C C C C C C C C C C
charge: -0.269303 -0.193520 -0.231254 -0.207187 -0.212283 -0.208083 -0.210591 0.028668 0.027006 0.176550 0.004206 -0.000306 -0.127837 -0.091050 0.184894 0.194949 0.547835 0.517025 -0.041948 -0.130787 -0.181082 -0.155606 -0.089016 -0.077627 -0.070541 -0.070239 -0.080629 0.231885 0.367956 0.367915
polarizability: 3.40882037e+02 -2.50149717e+00 2.43412724e+02 -1.60943448e+01 7.60191118e+00 2.55584904e+02
1716.lowfreq: -11.9132 -5.5130 -0.0007 -0.0005 0.0005 0.3485 5.3866 12.4724 17.2726
frequency: -3.3787 11.9591 17.1660 18.6222 24.4562 40.8923 42.1512 66.6863 66.7835 70.9385 84.4719 93.0902 96.8579 99.5550 108.4371 110.9576 124.9804 136.4368 152.9822 201.9349 207.9858 214.4838 231.5667 253.8728 255.3543 294.7845 313.3333 320.3435 343.0369 349.1716 351.4105 376.6841 381.0660 390.9337 408.3169 410.3035 466.9520 488.6646 505.0324 506.5717 510.2311 542.9382 574.8395 602.3385 626.3589 627.8427 628.0389 648.8169 670.7894 673.2865 690.5932 721.4570 734.5389 742.6869 754.6553 764.4193 775.8154 781.8539 821.2713 825.3305 846.7697 852.1378 856.3693 867.0484 871.0921 922.2190 952.6926 960.2049 986.5316 987.3244 988.8501 994.6752 1001.9888 1005.5965 1006.8570 1007.3866 1046.8253 1049.3076 1074.3175 1091.8419 1093.0283 1093.8134 1107.7244 1113.0975 1114.8127 1143.3236 1151.4995 1170.9410 1178.8430 1180.0566 1181.2613 1217.5197 1218.4670 1221.5990 1223.5129 1240.6714 1274.7252 1279.2944 1295.0890 1302.0555 1306.3029 1323.2159 1335.8542 1356.6017 1365.3410 1365.7871 1369.9561 1401.1181 1403.3993 1418.7305 1421.6393 1422.1368 1435.7228 1447.9689 1453.7003 1456.9966 1462.3199 1464.5835 1469.9485 1478.4845 1481.0098 1481.1714 1595.4621 1596.1965 1607.6090 1608.8128 1617.2273 1620.6901 2982.3991 2986.3567 2997.3394 3007.7323 3010.5429 3014.2547 3035.0633 3054.0131 3068.8350 3075.5298 3081.9468 3116.3408 3121.6642 3132.6177 3136.3292 3136.5897 3140.0479 3156.5501 3181.0164 3181.3752 3183.3534 3183.6723
redmass: 5.7284 5.9519 6.2297 5.4327 5.2863 5.5748 6.5687 7.1260 4.8774 5.3342 3.5593 2.9918 2.2616 1.5749 2.1258 2.2278 5.8387 5.2913 5.3171 4.1752 3.8951 3.7008 5.2317 5.4962 3.1502 2.8813 5.1089 3.9768 2.9769 3.0936 4.6773 6.7440 6.4839 4.8419 2.8915 2.9189 4.1487 4.1002 5.2714 6.9923 4.2719 3.7975 3.5381 3.7845 6.0950 6.7678 6.8430 4.2391 4.7122 4.3337 4.0498 3.0085 4.5552 4.2259 1.8294 2.3903 3.2498 4.8457 4.5969 3.3020 1.9664 1.3533 1.4103 1.8443 1.7179 4.8381 1.9197 3.2040 1.3840 1.8823 1.3886 1.3755 1.3683 3.0345 2.8391 2.1060 2.1292 3.6755 4.4238 4.0417 3.3037 3.3119 1.3310 1.3456 1.3630 1.5492 1.4560 1.4199 2.3903 1.3785 1.3682 2.6366 2.6488 6.1856 6.3503 1.7706 1.3500 1.1725 1.4201 1.2973 1.3159 1.3277 1.3629 1.4198 5.2256 5.5197 1.3494 8.1961 7.6645 3.2318 1.2650 2.7745 1.0758 1.0812 1.0499 1.0643 1.0697 1.0787 1.1214 1.2271 1.9603 2.3666 7.6266 7.6610 6.3620 6.2807 8.7583 9.1856 1.0589 1.0382 1.0599 1.0605 1.0292 1.0627 1.0995 1.0994 1.0961 1.1039 1.1003 1.1050 1.0998 1.0905 1.0908 1.0906 1.0913 1.1053 1.0942 1.0941 1.0952 1.0952
irintensity: 1.3666 1.3037 0.8327 0.4459 0.5547 0.3229 1.9387 0.0954 0.6801 0.2876 3.6843 3.1353 1.2234 0.9709 2.6150 0.5255 3.3477 0.7955 0.9706 3.9737 0.6840 2.3294 1.1493 3.8758 2.3088 1.1887 9.6951 6.5758 0.4951 2.5762 6.2568 4.5638 2.0581 2.9404 0.0085 0.0744 2.3067 11.5081 2.4462 1.4437 10.2318 9.2484 3.6851 0.6527 1.7671 0.8733 0.3702 7.4531 28.1359 21.6007 18.6583 5.4852 3.0986 11.3224 7.5360 11.0021 15.6187 21.4953 0.8087 23.5076 6.1347 2.4986 6.7655 40.4377 30.2478 24.0140 17.1634 2.8534 4.3195 1.0759 1.3843 0.1303 0.6519 4.2952 3.3886 4.9028 13.7418 11.9635 66.2596 25.2131 16.8582 19.8633 2.6226 5.6649 4.7602 95.7138 25.1601 36.3368 160.8652 66.2769 116.5329 10.3621 3.2366 425.5367 219.0568 28.2245 11.3923 6.3054 2.7885 3.6403 1.3135 5.2512 13.8439 4.9544 85.2947 41.9319 120.4692 0.3457 0.0605 38.3627 41.8659 24.4017 24.9164 9.6872 15.0961 13.9196 8.0262 9.1101 8.2778 18.0007 10.2704 18.5602 3.6127 1.9726 148.0476 51.1579 114.6341 180.5895 7.3185 4.3394 17.7387 16.3291 28.9799 22.2596 8.1981 0.5432 14.3494 16.4409 20.6043 18.2516 9.2147 14.7489 10.1902 10.5321 2.4690 12.5324 0.0031 0.0393 3.1114 4.4272
temp: 298.150 k
press: 1.00000 atm
elementType: 8 8 8 8 8 8 8 7 7 6 6 6 6 6 6 6 6 6 6 6 6 6 6 6 6 6 6 6 6 6 1 1 1 1 1 1 1 1 1 1 1 1 1 1 1 1 1 1 1 1 1 1
symmnumber: 1
zpe: 1042427.4 jmol-1
zpe.correction: 0.397040 hartree
zpe.thermalcorrener: 0.425814 hartree
zpe.thermalcorrenthalpy: 0.426758 hartree
zpe.thermalcorrgfe: 0.332320 hartree
zpe.sumelectzpe: -1447.146490 hartree
zpe.sumelectthermal: -1447.117716 hartree
zpe.sumelectthermalent: -1447.116771 hartree
zpe.sumelectthermalfe: -1447.211209 hartree
dipole: -2.9357 6.0660 1.5609
dipole: 6.9174
quadrupole: -277.6546 -200.3582 -161.1283
quadrupole: -7.0867 7.8560 -10.3444
quadrupole: -64.6076 12.6889 51.9187 -7.0867 7.8560 -10.3444
hfenergy: -1447.5435293 hartree
pointgroup: C01 [X(C21H22N2O7)]
dipole: 1.1930773 2.4094904 -0.421449 debye
polarizability: 340.3390789|1.9394|244.7507642|-17.6529343|-8.3022941|254.7898221 unknown
InChI: InChI=1S/C21H22N2O7/c1-15(24)21(20(25)30-2,13-11-16-3-7-18(8-4-16)22(26)27)14-12-17-5-9-19(10-6-17)23(28)29/h3-10H,11-14H2,1-2H3
charge 0 multiplicity 1
52 atoms
O  0.712084 3.008215 1.464198
O  -0.590806 3.510464 -1.087665
O  -1.14338 1.766829 2.085397
O  7.111632 -3.545212 0.835709
O  -7.794405 -2.893134 -0.685661
O  7.493621 -2.939411 -1.330344
O  -7.414215 -2.764504 1.559704
N  6.861511 -2.828431 -0.209309
N  -7.136301 -2.454299 0.336448
C  -0.054728 1.328841 -0.114935
C  1.223062 0.421627 -0.091652
C  -1.292171 0.387846 -0.354227
C  2.594058 1.116071 0.152335
C  -2.642933 1.119504 -0.604438
C  -0.05224 2.386655 -1.256015
C  -0.251256 2.035104 1.246988
C  3.728729 0.108803 0.060281
C  -3.825374 0.193077 -0.376106
C  0.508804 1.978682 -2.61247
C  4.050555 -0.714272 1.173676
C  -4.585988 -0.320273 -1.458528
C  4.465093 -0.058335 -1.142708
C  -4.178076 -0.183798 0.949907
C  5.073322 -1.678093 1.097552
C  -5.672564 -1.18986 -1.237193
C  5.49267 -1.016364 -1.24347
C  -5.260548 -1.047934 1.193738
C  0.544552 3.828618 2.692162
C  5.780917 -1.816618 -0.116864
C  -5.994074 -1.542436 0.091128
H  1.267618 -0.118925 -1.05689
H  1.072688 -0.355871 0.683591
H  -1.071623 -0.288632 -1.201817
H  -1.390214 -0.241266 0.548647
H  2.742076 1.92551 -0.586051
H  2.587842 1.598476 1.143892
H  -2.714154 1.978205 0.086468
H  -2.671452 1.527347 -1.631332
H  1.607712 1.86521 -2.569453
H  0.262893 2.756171 -3.351944
H  0.096649 1.008017 -2.945765
H  3.498561 -0.589412 2.112608
H  -4.328599 -0.030428 -2.483718
H  4.237199 0.576689 -2.006843
H  -3.598894 0.219752 1.788728
H  5.335373 -2.31458 1.946808
H  -6.269982 -1.592834 -2.059191
H  6.070495 -1.153452 -2.161285
H  -5.550612 -1.341642 2.205967
H  1.406236 4.509777 2.69132
H  0.538082 3.185242 3.587566
H  -0.403344 4.387781 2.632954
