program: Gaussian 09
title: 000220313
version: EM64L-G09RevD.01
frameworkgroup: C1[X(C7H6I2O)]
method: RPBEPBE
basis: SDD
operation: Freq
keyword: #pfreq=noraman
keyword: PBEPBE/SDD
title: #p freq=noraman PBEPBE/SDD
converged: NO NO NO NO
title: Mulliken charges:
elementType: I I O C C C C C C C H H H H H H
charge: 0.140602 0.104417 -0.408614 0.352858 0.309962 -0.312377 -0.495269 -0.847662 -0.353097 -0.128970 0.254585 0.239444 0.239327 0.255878 0.272516 0.376397
chargesum: 0.00000
title: Mulliken charges with hydrogens summed into heavy atoms:
elementType: I I O C C C C C C C
charge: 0.140602 0.104417 -0.032217 0.352858 0.309962 -0.057792 -0.495269 -0.113013 -0.353097 0.143547
polarizability: 1.91899741e+02 1.09841173e+00 1.38363232e+02 -1.62009830e-02 -4.70837366e-03 4.26881226e+01
1716.lowfreq: -6.9129 0.0002 0.0005 0.0005 4.0809 9.8547 89.1241 90.9370 104.6122
frequency: 89.1186 90.9290 104.6082 157.2983 166.9182 195.8029 207.3438 279.6915 286.1169 309.0195 323.7696 474.7541 489.4364 541.8861 549.7645 634.9331 718.6860 784.3289 845.7167 873.4775 884.7550 983.5054 1042.1761 1098.1258 1106.0649 1170.8923 1250.2444 1274.8598 1364.9071 1385.2616 1397.9961 1438.3034 1477.3392 1478.4065 1549.3956 1596.6060 2954.9731 3024.6370 3089.7783 3159.9124 3178.8728 3589.8742
redmass: 4.5559 25.9667 5.8369 1.1178 5.4706 2.4717 12.4244 7.3987 1.4543 3.8781 3.4663 4.5986 3.9500 4.2795 3.9659 8.9289 5.3398 6.7118 6.0736 1.3692 1.3452 1.5736 1.5001 2.2415 1.7487 3.2794 1.2820 2.3370 5.2859 3.3504 1.3858 2.5819 1.0434 1.2163 6.2812 7.0882 1.0403 1.0982 1.0943 1.0923 1.0932 1.0655
irintensity: 0.1612 0.0093 2.5369 0.0515 2.7694 9.2570 0.1659 0.2204 104.2671 3.0512 23.3512 10.0796 0.0774 1.2320 9.1745 58.0080 11.4585 9.4854 27.2552 28.3589 1.3290 6.4829 6.0429 24.1096 65.4036 211.0271 25.0907 5.7220 31.6392 9.0677 34.7803 92.5292 16.4080 55.6472 29.4666 2.0963 30.3026 18.9321 10.4109 3.4795 0.0385 48.1568
temp: 298.150 k
press: 1.00000 atm
elementType: 53 53 8 6 6 6 6 6 6 6 1 1 1 1 1 1
symmnumber: 1
zpe: 284833.8 jmol-1
zpe.correction: 0.108487 hartree
zpe.thermalcorrener: 0.119186 hartree
zpe.thermalcorrenthalpy: 0.120131 hartree
zpe.thermalcorrgfe: 0.069063 hartree
zpe.sumelectzpe: -367.847367 hartree
zpe.sumelectthermal: -367.836668 hartree
zpe.sumelectthermalent: -367.835723 hartree
zpe.sumelectthermalfe: -367.886791 hartree
dipole: -0.2797 3.7197 0.0002
dipole: 3.7302
quadrupole: -90.8027 -67.9161 -91.8102
quadrupole: 1.9423 0.0008 -0.0010
quadrupole: -7.2930 15.5935 -8.3005 1.9423 0.0008 -0.0010
hfenergy: -367.955854 hartree
pointgroup: C01 [X(C7H6I2O1)]
dipole: -0.3190575 -1.4324847 0.0000673 debye
dipolederiv: -0.2030503 0.2168036 -0.0000155 0.294048 -0.2429364 0.0000047 -0.0000707 -0.0000648 0.0276349 -0.5238221 -0.045327 -0.0000709 -0.0662609 -0.0394078 0.0000067 -0.0000052 0.0000901 0.0013683 -1.3265812 -0.4135414 -0.0001323 -0.2858513 -0.1454635 -0.0001187 -0.0002199 -0.0001501 -0.395236 -0.0639055 -0.1756212 -0.0000003 0.1548673 0.2332893 0.0000227 -0.0001377 -0.0001612 -0.0552024 1.0079151 0.7095618 0.0001313 0.3323599 -0.2211413 0.000044 0.0002254 0.0001406 0.105674 -0.3792339 -0.0507324 -0.0000506 0.0154399 0.0017215 -0.0000056 0.000006 0.0000436 -0.1025777 0.3108726 -0.5305518 0.0000312 -0.7185908 0.6017431 -0.0000371 0.0001533 0.0001189 -0.1813419 -0.0534512 -0.0205823 0.0000627 -0.0259693 -0.0831352 -0.0000587 -0.0000739 0.0000892 0.0875969 1.1273483 0.1763389 0.0001698 0.1414617 -0.0779541 0.000025 0.0001331 -0.0000599 -0.1711943 -0.4627986 0.0622979 -0.0000441 0.1094964 -0.1765762 -0.000026 -0.0001166 -0.0000694 -0.0415708 0.053632 0.0753147 -0.0000215 0.0809646 -0.012661 0.0000032 -0.0000466 -0.0000434 0.1556314 0.0022889 -0.0882953 0.1145891 -0.0358436 0.0229149 -0.004493 0.1031914 0.0488122 -0.0361199 0.0019687 -0.0883079 -0.1148048 -0.0356974 0.0230143 0.0046759 -0.1031512 -0.0486849 -0.0358531 -0.0091341 0.1610609 0.000176 0.0548876 0.0036001 -0.0000894 0.0000869 -0.0000968 0.1231595 0.1028095 -0.0389808 -0.0000042 -0.0388288 0.0068986 -0.0000152 -0.0000109 -0.0000284 0.159849 0.4151417 0.0505623 -0.0000157 0.0235169 0.1060936 0.0000616 0.0000367 0.0000643 0.3581822 unknown
polarizability: 188.0076522|-13.943708|142.2553202|0.0168702|-0.0001919|42.6881226 unknown
InChI: InChI=1S/C7H6I2O/c1-4-2-5(8)3-6(9)7(4)10/h2-3,10H,1H3
charge 0 multiplicity 1
16 atoms
I  -1.987703 2.732414 -0.0002
I  3.774806 0.575346 0.000559
O  -2.512167 -0.410248 -0.000401
C  -0.228136 -1.34951 -0.000198
C  -1.126878 -0.240889 -0.000243
C  1.163224 -1.098232 0.000037
C  -0.624931 1.083409 -0.000108
C  -0.774493 -2.765239 -0.000312
C  1.65013 0.226257 0.000201
C  0.766325 1.326996 0.000113
H  1.858275 -1.94328 0.000077
H  -1.391129 -2.975642 0.89729
H  -1.392537 -2.975011 -0.897096
H  0.045854 -3.501273 -0.001256
H  1.142447 2.352616 0.000228
H  -2.760788 -1.367216 -0.00029
