program: Gaussian 09
title: 000220338
version: EM64L-G09RevD.01
frameworkgroup: C1[X(C20H30O2)]
method: RPBEPBE
basis: SDD
operation: Freq
keyword: #pfreq=noraman
keyword: PBEPBE/SDD
title: #p freq=noraman PBEPBE/SDD
converged: NO YES NO NO
title: Mulliken charges:
elementType: O O C C C C C C C C C C C C C C C C C C C C H H H H H H H H H H H H H H H H H H H H H H H H H H H H H H
charge: -0.433035 -0.221249 0.428805 -0.141440 -0.268107 0.238409 -0.520352 -0.506398 0.539570 -0.455083 -0.445120 -0.519490 -0.661507 -0.842499 -0.508245 0.276302 -0.784940 -0.557060 0.082876 -0.761740 -0.101662 -0.579131 0.242893 0.211450 0.196730 0.223155 0.220953 0.226269 0.207061 0.228187 0.202247 0.213085 0.231149 0.220177 0.209183 0.231366 0.230323 0.235681 0.216046 0.202594 0.201303 0.241432 0.241234 0.210009 0.230741 0.210490 0.221218 0.222117 0.212259 0.377391 0.207332 0.217026
chargesum: 0.00000
title: Mulliken charges with hydrogens summed into heavy atoms:
elementType: O O C C C C C C C C C C C C C C C C C C C C
charge: -0.055644 -0.221249 0.428805 0.101453 -0.056657 0.238409 -0.100468 -0.059176 0.539570 -0.019835 -0.029788 -0.068165 -0.220959 -0.160449 -0.104349 0.276302 -0.092265 -0.326319 0.082876 -0.107916 0.110597 -0.154773
polarizability: 2.59765149e+02 2.05716614e+00 1.89445512e+02 -4.02092911e+00 2.94743426e-01 1.87929364e+02
1716.lowfreq: -16.8445 -4.7668 -0.0008 -0.0006 0.0006 12.3083 36.9682 39.6504 46.6338
frequency: 36.8226 38.4951 46.5670 79.5980 88.6463 95.1193 112.1487 122.7992 164.8314 184.2156 201.2554 211.3362 218.7500 225.3716 251.7467 260.8637 263.5929 287.3300 304.0763 314.4903 322.1488 329.8868 357.6238 359.4303 369.0613 413.5284 418.5829 425.1354 448.2245 461.0399 475.0682 504.8928 508.1961 538.7616 559.3594 574.6362 589.9630 600.5915 666.6033 686.1730 700.6368 715.5971 726.1262 759.6336 791.5830 816.2151 838.4553 854.0366 856.5689 870.9721 891.5159 894.2851 919.4575 931.5990 932.9632 947.6625 959.3244 966.2230 980.0153 986.1095 997.1189 1000.8159 1016.1285 1025.1534 1028.7474 1035.9803 1060.8796 1075.9789 1082.8157 1090.0482 1093.4872 1103.4066 1131.0939 1139.7130 1151.4213 1154.6776 1164.7423 1191.8895 1193.9958 1199.0874 1209.6114 1219.3645 1231.6708 1250.3773 1266.5162 1271.7121 1280.9480 1297.7320 1302.0961 1308.8489 1314.9437 1329.2887 1331.6225 1335.4834 1338.6854 1346.3199 1347.5675 1358.4377 1363.6444 1377.2352 1379.3639 1390.2884 1398.6779 1407.8478 1454.1184 1458.1281 1461.4721 1463.1631 1466.7787 1470.2290 1471.0047 1471.5858 1473.6645 1476.0867 1477.9411 1490.3640 1493.2606 1640.0828 1645.2388 1672.5445 2895.2007 2937.7094 2951.8857 2959.3347 2966.8330 2969.4305 2979.6166 2980.5527 2988.5702 2991.7652 2996.3965 3005.5664 3022.4493 3024.4431 3027.3754 3032.4916 3039.7230 3051.7259 3052.5313 3054.6603 3064.6887 3068.5202 3071.6498 3075.5001 3092.1275 3093.5190 3104.9764 3113.8080 3194.6560 3513.6497
redmass: 9.4573 3.7423 3.7072 2.2198 3.2266 1.9728 3.0308 2.1677 1.7010 2.5546 1.8429 2.7146 1.1388 2.6124 2.4479 2.6961 2.3954 2.3109 2.7385 2.2991 2.5499 2.0537 2.9152 2.7450 2.5050 2.8630 2.7057 3.1517 2.4825 3.0386 3.6961 3.4723 2.3780 2.0936 2.6674 2.7586 1.4265 3.0985 2.7095 2.0728 3.5585 3.0869 2.5518 2.8399 2.6470 2.0838 2.0761 1.8135 1.6066 1.9015 2.0735 1.7349 1.9263 1.7916 1.3516 1.8762 1.8299 2.1043 1.6446 2.2251 2.1402 1.2060 2.1584 1.6879 1.7151 2.0613 1.9879 1.7483 2.2622 1.9470 2.3418 1.7767 2.0489 1.7513 2.4829 1.9354 2.3080 1.8808 2.0193 1.6928 1.6419 1.4782 1.5630 1.6900 1.6598 1.5104 2.1927 1.3688 1.4064 1.3852 1.4839 1.4391 1.3616 1.3475 1.4523 1.3779 1.5038 1.4975 1.5387 1.2195 1.2598 1.2749 1.2057 1.1908 1.0882 1.0740 1.0780 1.0774 1.0729 1.0670 1.0654 1.0660 1.0648 1.0866 1.0716 1.0575 1.0584 8.6053 4.9191 8.5037 1.0807 1.0661 1.0654 1.0795 1.0497 1.0443 1.0601 1.0613 1.0612 1.0436 1.0590 1.0369 1.0939 1.0995 1.0953 1.1019 1.1008 1.1017 1.0843 1.1014 1.0974 1.0905 1.0979 1.0999 1.0675 1.0987 1.0985 1.0951 1.1146 1.0640
irintensity: 0.4618 0.0952 0.0058 0.1260 0.4426 0.0443 0.0383 0.0304 0.2795 0.0182 0.0951 0.2321 0.3140 0.0551 0.5707 0.1162 0.2033 0.0695 1.1641 0.5055 0.6429 1.9112 1.7817 1.0177 2.6293 0.9335 3.0382 0.7978 2.3784 6.3751 3.4792 11.2000 5.0473 4.6258 8.3935 6.7040 68.7066 40.1967 6.3745 21.9313 15.4533 7.5757 0.2203 9.2304 1.0706 4.0375 0.4901 1.8787 14.9838 10.0552 4.6810 2.3533 0.9062 0.6655 66.4044 12.0057 1.3717 9.2842 12.4318 4.5862 70.3020 15.4012 78.6397 17.2101 34.4833 8.1815 49.3020 21.4371 3.6283 4.3022 1.9231 6.3712 0.5169 4.1578 7.3784 7.8189 4.1628 0.8632 0.5381 2.9604 7.2532 0.3903 0.9098 1.1026 2.2376 1.2069 9.7445 2.2151 2.4322 3.9376 1.3138 2.0050 1.1902 1.1628 1.2415 2.2409 0.6423 0.2393 7.5459 16.0392 6.7334 0.9374 36.9205 11.9280 10.4818 3.6780 1.5156 5.7875 6.3592 13.5230 12.5792 1.3010 12.2145 11.2141 6.4585 20.4744 2.3065 232.8558 18.2050 4.3150 25.9806 27.7301 19.3980 21.1850 10.2439 82.8963 13.2874 44.5179 62.1760 11.7378 12.9261 18.3067 36.0733 4.9025 74.0064 33.8757 41.7905 46.1662 29.0895 39.0942 35.9668 29.8415 28.8757 40.0568 10.6521 34.8948 23.8085 22.2835 31.2880 22.9947
temp: 298.150 k
press: 1.00000 atm
elementType: 8 8 6 6 6 6 6 6 6 6 6 6 6 6 6 6 6 6 6 6 6 6 1 1 1 1 1 1 1 1 1 1 1 1 1 1 1 1 1 1 1 1 1 1 1 1 1 1 1 1 1 1
symmnumber: 1
zpe: 1193026.3 jmol-1
zpe.correction: 0.454400 hartree
zpe.thermalcorrener: 0.476678 hartree
zpe.thermalcorrenthalpy: 0.477623 hartree
zpe.thermalcorrgfe: 0.404754 hartree
zpe.sumelectzpe: -928.848011 hartree
zpe.sumelectthermal: -928.825732 hartree
zpe.sumelectthermalent: -928.824788 hartree
zpe.sumelectthermalfe: -928.897657 hartree
dipole: 0.9869 1.0194 -1.6678
dipole: 2.1897
quadrupole: -142.3114 -132.7158 -133.8704
quadrupole: -2.6050 5.5105 3.8889
quadrupole: -6.0122 3.5834 2.4288 -2.6050 5.5105 3.8889
hfenergy: -929.3024109 hartree
pointgroup: C01 [X(C20H30O2)]
dipole: -0.3871617 0.4804795 0.6011548 debye
polarizability: 259.7528681|-3.0518025|189.3939484|-3.4532466|-0.4529886|187.9932088 unknown
InChI: InChI=1S/C20H30O2/c1-5-18(2)12-9-15-14(13-18)7-8-16-19(15,3)10-6-11-20(16,4)17(21)22/h5,13,15-16,21H,1,6-12H2,2-4H3
charge 0 multiplicity 1
52 atoms
O  3.688739 -1.16657 1.721453
O  4.67702 -1.765015 -0.276322
C  0.401575 0.858418 -0.077439
C  1.468672 -0.284215 0.114892
C  -0.892159 0.396847 0.726684
C  2.965309 0.063556 -0.276306
C  0.945275 2.165108 0.57276
C  0.976175 -1.609823 -0.511935
C  -1.388217 -0.975567 0.26632
C  3.371975 1.422615 0.395277
C  2.360121 2.54586 0.086527
C  -2.028399 1.452771 0.716906
C  -0.331917 -2.069866 0.17618
C  0.027902 1.110787 -1.56522
C  -3.360134 0.864925 1.221982
C  -3.861119 -0.293535 0.299594
C  3.274713 0.103267 -1.795612
C  -2.702765 -1.24821 0.038035
C  3.85773 -1.036599 0.327801
C  -4.997649 -1.07007 1.032817
C  -4.455094 0.291952 -0.984914
C  -3.956404 0.178543 -2.240717
H  1.511938 -0.448113 1.213506
H  -0.55055 0.278886 1.783171
H  0.976933 2.029181 1.675389
H  0.247227 2.999891 0.372845
H  1.743918 -2.400825 -0.398683
H  0.806555 -1.486867 -1.597689
H  4.38552 1.707825 0.050816
H  3.423261 1.281449 1.491488
H  2.689277 3.474336 0.59256
H  2.345448 2.77263 -0.997143
H  -2.186491 1.831674 -0.309687
H  -1.741943 2.318127 1.343044
H  -0.070877 -2.38321 1.211191
H  -0.748489 -2.962022 -0.328615
H  0.913577 1.219277 -2.209544
H  -0.584958 0.288073 -1.974017
H  -0.563733 2.038382 -1.666461
H  -3.229262 0.46224 2.247369
H  -4.13105 1.658972 1.279299
H  4.366602 0.084172 -1.954005
H  2.857312 -0.769179 -2.325314
H  2.879693 1.019002 -2.262344
H  -2.981621 -2.256964 -0.304811
H  -5.84277 -0.396278 1.271631
H  -5.384754 -1.89331 0.40466
H  -4.622995 -1.501442 1.979266
H  -5.389271 0.858914 -0.830035
H  4.301832 -1.8798 2.047307
H  -4.460668 0.63498 -3.100439
H  -3.03281 -0.378776 -2.436913
