program: Gaussian 09
title: 000220305
version: EM64L-G09RevD.01
frameworkgroup: C1[X(C15H11BrO3)]
method: RPBEPBE
basis: SDD
operation: Freq
keyword: #p
keyword: freq=noraman
keyword: PBEPBE/SDD
title: #p freq=noraman PBEPBE/SDD
converged: YES YES NO NO
title: Mulliken charges:
elementType: Br O O O C C C C C C C C C C C C C C C H H H H H H H H H H H
charge: 0.027924 -0.307724 -0.184365 -0.232502 0.303397 0.385987 -0.332582 -0.321662 -0.322689 -0.405628 0.218098 0.199740 0.161403 -0.326329 -0.325569 -0.219888 -0.214504 -0.811921 -0.218623 0.239905 0.283708 0.308805 0.259792 0.269952 0.266645 0.237793 0.235634 0.294074 0.294079 0.237046
chargesum: 0.00000
title: Mulliken charges with hydrogens summed into heavy atoms:
elementType: Br O O O C C C C C C C C C C C C C C C
charge: 0.027924 -0.307724 -0.184365 -0.232502 0.303397 0.385987 -0.092676 -0.037954 -0.013883 -0.145836 0.218098 0.199740 0.161403 -0.056377 -0.058924 0.017905 0.021130 -0.223767 0.018423
polarizability: 3.67022898e+02 7.82759834e+00 1.75580964e+02 -2.03814750e-01 -4.85991284e-02 7.17734468e+01
1716.lowfreq: -1.2140 -0.0003 -0.0002 0.0004 6.3817 13.3873 19.7159 28.0194 40.0146
frequency: 19.2807 28.0107 40.0091 51.7488 61.6141 74.5991 102.8671 119.1810 142.8934 174.0489 226.6533 232.1924 294.7348 312.1457 361.9376 402.6660 407.8031 423.8211 436.6660 478.3647 485.6870 564.5359 584.5489 614.3920 621.9094 661.0097 672.5165 684.4180 699.1869 730.9064 736.0849 778.0395 795.5880 823.7560 834.7844 851.2736 863.9865 900.9465 957.2256 979.7971 982.5100 990.3270 997.1449 998.3544 1000.5172 1011.6994 1012.4926 1034.4947 1087.8241 1117.4735 1134.0269 1152.5241 1176.3281 1184.1451 1196.6128 1208.8906 1235.5609 1268.2570 1304.0805 1316.7030 1375.7451 1392.1624 1408.8878 1419.0024 1439.5058 1477.3772 1487.5375 1564.2495 1585.2873 1603.6678 1611.1700 1617.6114 1633.4856 3033.4260 3109.0361 3134.2868 3145.9887 3146.4481 3156.1254 3158.4033 3170.0695 3175.4180 3184.4363 3213.2196
redmass: 8.8918 4.2341 5.9738 8.0031 6.5747 3.0937 7.2454 6.9117 13.0425 5.4019 6.7266 9.6704 6.1836 7.6806 6.1495 2.8198 2.9530 9.0143 3.6844 7.1085 3.1623 2.2594 8.0135 6.4461 7.2442 6.4624 5.2076 6.8144 1.6275 3.6262 7.4658 8.4683 2.0903 7.0535 1.4159 1.3641 1.2460 1.9458 1.4175 4.9934 1.3408 6.2926 1.3815 1.3601 5.2914 1.3352 2.7390 2.1248 1.5796 1.3137 1.1182 2.2761 1.0565 1.1346 1.7933 1.5990 3.7848 2.1254 1.2813 1.3190 5.9632 9.8357 1.1166 3.7696 2.2575 2.2429 2.4718 7.6915 6.4509 7.7994 6.2607 7.3189 11.2721 1.0568 1.1065 1.0858 1.0907 1.0893 1.0884 1.0941 1.0986 1.0973 1.0969 1.0945
irintensity: 0.4223 2.4525 0.7701 0.7710 5.2859 3.9738 0.5978 0.0227 0.1448 0.1578 2.5438 1.9788 1.0904 4.4036 10.5669 0.0001 0.0887 1.3505 0.0874 1.5256 6.4730 10.6619 16.8285 1.3404 3.5216 94.5374 15.9582 4.0177 86.5835 0.6685 1.2041 6.5980 24.6016 8.3123 60.7690 37.0531 0.1012 2.9519 4.2345 244.0286 3.3428 8.9871 0.0082 0.3239 201.4631 0.2626 110.6076 98.4692 7.5558 20.3443 3.0594 703.3469 0.1790 69.3676 172.4986 157.3440 293.8178 72.5019 0.9128 0.6720 1.6376 3.8113 13.9921 65.6645 16.3266 8.4618 60.6768 103.7555 19.0589 155.5273 22.5549 25.2960 177.3407 26.9957 1.0023 0.1180 13.1708 8.3971 0.1145 14.2312 24.5327 5.6920 7.6629 5.0399
temp: 298.150 k
press: 1.00000 atm
elementType: 35 8 8 8 6 6 6 6 6 6 6 6 6 6 6 6 6 6 6 1 1 1 1 1 1 1 1 1 1 1
symmnumber: 1
zpe: 573515.7 jmol-1
zpe.correction: 0.218441 hartree
zpe.thermalcorrener: 0.235354 hartree
zpe.thermalcorrenthalpy: 0.236299 hartree
zpe.thermalcorrgfe: 0.169660 hartree
zpe.sumelectzpe: -816.001974 hartree
zpe.sumelectthermal: -815.985060 hartree
zpe.sumelectthermalent: -815.984116 hartree
zpe.sumelectthermalfe: -816.050755 hartree
dipole: -6.5168 -0.8259 0.0374
dipole: 6.5690
quadrupole: -112.8175 -115.1000 -122.7657
quadrupole: -16.4535 -0.0397 -0.0799
quadrupole: 4.0769 1.7944 -5.8713 -16.4535 -0.0397 -0.0799
hfenergy: -816.2204149 hartree
pointgroup: C01 [X(C15H11Br1O3)]
dipole: 2.566707 0.3023737 -0.0024549 debye
polarizability: 367.1003712|6.3043435|175.1103088|-3.4287676|5.9671185|72.1666284 unknown
InChI: InChI=1S/C15H11BrO3/c16-10-14(17)11-6-8-13(9-7-11)19-15(18)12-4-2-1-3-5-12/h1-9H,10H2
charge 0 multiplicity 1
30 atoms
Br -7.439201 0.540729 0.238309
O  1.085626 -0.251909 0.071108
O  -5.192429 -1.599162 0.078459
O  1.608925 2.045268 0.185447
C  -3.154415 -0.313683 0.12974
C  -0.329287 -0.161576 0.095842
C  -2.491609 0.940219 0.203343
C  -2.367463 -1.496774 0.03826
C  -1.084631 1.033865 0.187786
C  -0.968008 -1.424628 0.021115
C  3.390473 0.384813 0.077894
C  -4.648974 -0.46522 0.142202
C  1.97901 0.852075 0.118454
C  4.408621 1.375216 0.118887
C  3.741597 -0.989393 0.002935
C  5.764394 0.994316 0.085737
C  5.100678 -1.364203 -0.029791
C  -5.462303 0.835969 0.235706
C  6.113042 -0.375908 0.011574
H  -3.062444 1.872209 0.274803
H  -2.885042 -2.459489 -0.018246
H  -0.584892 2.000439 0.244074
H  -0.351142 -2.325156 -0.048906
H  4.115832 2.428697 0.176865
H  2.952298 -1.744565 -0.028442
H  6.547538 1.758958 0.117682
H  5.372183 -2.423567 -0.08755
H  -5.233495 1.376054 1.169606
H  -5.252763 1.492919 -0.624813
H  7.167686 -0.671815 -0.013982
